{"text_format":"1","workbook":"xlsx","n_sheets":21,"sheets":["Árlista","Megrendelő","ABAC Kompresszor","ABAC CleanAir","ALUP szűrő","ALUP LARGO","ALUP SCK  ","ALUP SONETTO","ALUP PRACTIC","ALUP Hűtveszárító","SpiralAir","Segéd","ST","Tartály","OMEGA CKL-B ciklon","OMEGA AF szűrők","OMEGA WOS","AGRE ip dugattyús","ABAC sűrítők és alkatr","Nyomáskapcsolók","Visszacsapók"],"not_rendered":{"charts":0,"images":266,"macros":1,"external_links":1,"defined_names":29,"comments":1,"pivot_tables":0},"unopened":[],"bounds":{"document_bytes":16777216,"sheet_cells":100000,"rows_first":2000,"rows_last":500,"rows_between":2000,"halvings":0,"cell_chars":16384,"cell_head_chars":4096},"cells_cut":0,"cells_raw":0,"read":"whole","date_system":"1900"}

{"sheet":"Árlista","index":0,"n_rows":839,"n_cols":14,"rows_kept":839,"cut":false,"hidden":false,"merged":[]}
[null,null,null,null,null,null,"1",null,1,1,null,-1,null,340]
[null,"Cikkszám","Termék megnevezése","Nettó listaárak","Típusa","Termék fajtája","Tömeg","SP","Nettó listaárak","\nHUF","WEBSHOP","KOSÁR"]
[{"$f":"IF(L3=FALSE,0,1)","v":0},8951000156,"RC2277 The Beast + Focilabda",{"$f":"IF(H3=\"SP\",IF(J3>0,\"SP: \"&DOLLAR(J3*I$1,0),\"SP: \"&DOLLAR(I3*I$1,0)),IF(J3>0,\"*(\"&DOLLAR(I3*I$1,0)&\") \"&DOLLAR(J3*J$1,0),DOLLAR(I3*I$1,0)))","v":"0 Ft"},null,null,5246]
[{"$f":"IF(L4=FALSE,0,COUNTIF(A$3:A3,\">0\")+1)","v":0},"8944077332X","CP7733 1/2\" IMPACT WRENCH\n746Nm + Dugókulcs készlet + Mágnes takaró","0 Ft",null,null,2555]
[{"$f":"IF(L5=FALSE,0,COUNTIF(A$3:A4,\">0\")+1)","v":0},4116092255,"CLR 15/25",{"$f":"IF(H5=\"SP\",IF(J5>0,\"SP: \"&TEXT(J5*I$1,\"# ###,-Ft  \"),\"SP: \"&TEXT(I5*I$1,\"# ###,-Ft\")),IF(J5>0,\"*(\"&TEXT(I5*I$1,\"# ###,-\")&\") \n\"&TEXT(J5*J$1,\"# ###,-Ft\"),TEXT(I5*I$1,\"# ###,-Ft  \")))","v":"204 000,-Ft "},"CleanAir",null,{"$f":"I5/340","v":600},null,204000,null,null,null,null,"MEGRENDELŐ"]
[{"$f":"IF(L6=FALSE,0,COUNTIF(A$3:A5,\">0\")+1)","v":0},4116092256,"CLR 15/25 T",{"$f":"IF(H6=\"SP\",IF(J6>0,\"SP: \"&TEXT(J6*I$1,\"# ###,-Ft  \"),\"SP: \"&TEXT(I6*I$1,\"# ###,-Ft\")),IF(J6>0,\"*(\"&TEXT(I6*I$1,\"# ###,-\")&\") \n\"&TEXT(J6*J$1,\"# ###,-Ft\"),TEXT(I6*I$1,\"# ###,-Ft  \")))","v":"411 400,-Ft "},"CleanAir",null,{"$f":"I6/340","v":1210},null,411400,null,null,null,null,"TARTALOM"]
[{"$f":"IF(L7=FALSE,0,COUNTIF(A$3:A6,\">0\")+1)","v":0},4116092259,"CLR 15/50","217 600,-Ft ","CleanAir",null,640,null,217600,null,null,null,null,"Árlista"]
[{"$f":"IF(L8=FALSE,0,COUNTIF(A$3:A7,\">0\")+1)","v":0},4116092260,"CLR 15/50 T","431 800,-Ft ","CleanAir",null,1270,null,431800,null,null,null,null,"Megrendelő"]
[{"$f":"IF(L9=FALSE,0,COUNTIF(A$3:A8,\">0\")+1)","v":0},4116092257,"CLR 20/25","241 400,-Ft ","CleanAir",null,710,null,241400,null,null,null,null,"ABAC dugattyús kompresszorok"]
[{"$f":"IF(L10=FALSE,0,COUNTIF(A$3:A9,\">0\")+1)","v":0},4116092258,"CLR 20/25 T","448 800,-Ft ","CleanAir",null,1320,null,448800,null,null,null,null,"ABAC CleanAir fogászati kompresszor"]
[{"$f":"IF(L11=FALSE,0,COUNTIF(A$3:A10,\">0\")+1)","v":0},4116092261,"CLR 20/50","251 600,-Ft ","CleanAir",null,740,null,251600,null,null,null,null,"AGRE ipari dugattyús kompresszorok"]
[{"$f":"IF(L12=FALSE,0,COUNTIF(A$3:A11,\">0\")+1)","v":0},4116092262,"CLR 20/50 T","472 600,-Ft ","CleanAir",null,1390,null,472600,null,null,null,null,"ALUP SONETTO csavarkomp 2,2-15kW"]
[{"$f":"IF(L13=FALSE,0,COUNTIF(A$3:A12,\">0\")+1)","v":0},4116092289,"CLR 25/50","489 600,-Ft ","CleanAir",null,1440,null,489600,null,null,null,null,"ALUP SCK csavarkomp 4-75kW"]
[{"$f":"IF(L14=FALSE,0,COUNTIF(A$3:A13,\">0\")+1)","v":0},4116092290,"CLR 25/50  T","595 000,-Ft ","CleanAir",null,1750,null,595000,null,null,null,null,"ALUP LARGO, ALLEGRO csavarkompr"]
[{"$f":"IF(L15=FALSE,0,COUNTIF(A$3:A14,\">0\")+1)","v":0},4116092267,"CLR 15/30 S","435 200,-Ft ","CleanAir",null,1280,null,435200,null,null,null,null,"ALUP Hűtveszárítók"]
[{"$f":"IF(L16=FALSE,0,COUNTIF(A$3:A15,\">0\")+1)","v":0},4116092268,"CLR 15/30 S T","612 000,-Ft ","CleanAir",null,1800,null,612000,null,null,null,null,"ALUP szűrők"]
[{"$f":"IF(L17=FALSE,0,COUNTIF(A$3:A16,\">0\")+1)","v":0},4116092269,"CLR 20/30 S","472 600,-Ft ","CleanAir",null,1390,null,472600,null,null,null,null,"ALUP SpiralAir -Scroll kompresszor"]
[{"$f":"IF(L18=FALSE,0,COUNTIF(A$3:A17,\">0\")+1)","v":0},4116092270,"CLR 20/30 S T",{"$f":"IF(H18=\"SP\",IF(J18>0,\"SP: \"&TEXT(J18*I$1,\"# ###,-Ft  \"),\"SP: \"&TEXT(I18*I$1,\"# ###,-Ft\")),IF(J18>0,\"*(\"&TEXT(I18*I$1,\"# ###,-\")&\") \n\"&TEXT(J18*J$1,\"# ###,-Ft\"),TEXT(I18*I$1,\"# ###,-Ft  \")))","v":"646 000,-Ft "},"CleanAir",null,1900,null,646000,null,null,null,null,"ALUP dugattyús kompresszorok"]
[{"$f":"IF(L19=FALSE,0,COUNTIF(A$3:A18,\">0\")+1)","v":0},8115465687,"CNR 75/BM S YD 400/3/50",{"$f":"IF(H19=\"SP\",IF(J19>0,\"SP: \"&TEXT(J19/340*I$1,\"# ###,-Ft  \"),\"SP: \"&TEXT(I19/340*I$1,\"# ###,-€\")),IF(J19>0,\"*(\"&TEXT(I19/340*I$1,\"# ###,-\")&\") \n\"&TEXT(J19/340*J$1,\"# ###,-€\"),TEXT(I19/340*I$1,\"# ###,-€ \")))","v":"9 370,-€ "},"CleanAir",null,9370,null,{"$f":"G19*340","v":3185800},null,null,null,null,"OMEGA vonali szűrők"]
[{"$f":"IF(L20=FALSE,0,COUNTIF(A$3:A19,\">0\")+1)","v":0},8115465695,"CNR 75/270 S YD 400/3/50","12 150,-€ ","CleanAir",null,12150,null,{"$f":"G20*340","v":4131000},null,null,null,null,"OMEGA ciklonszűrők"]
[{"$f":"IF(L21=FALSE,0,COUNTIF(A$3:A20,\">0\")+1)","v":0},8115465703,"CNR 75/500 S YD 400/3/50","12 770,-€ ","CleanAir",null,12770,null,4341800,null,null,null,null,"OMEGA olaj-víz szétválasztók"]
[{"$f":"IF(L22=FALSE,0,COUNTIF(A$3:A21,\">0\")+1)","v":0},8115475439,"CNR 100/BM S YD 400/3/50","10 710,-€ ","CleanAir",null,10710,null,3641400,null,null,null,null,"ABAC sűrítők"]
[{"$f":"IF(L23=FALSE,0,COUNTIF(A$3:A22,\">0\")+1)","v":0},8115475462,"CNR 100/270 S YD 400/3/50","14 320,-€ ","CleanAir",null,14320,null,4868800,null,null,null,null,"CONDOR nyomáskapcsolók"]
[{"$f":"IF(L24=FALSE,0,COUNTIF(A$3:A23,\">0\")+1)","v":0},8115475496,"CNR 100/500 S YD 400/3/50","14 940,-€ ","CleanAir",null,14940,null,5079600,null,null,null,null,"Tartályok"]
[{"$f":"IF(L25=FALSE,0,COUNTIF(A$3:A24,\">0\")+1)","v":0},4153126616,"AKK 301-W","1 139,-€ ","AGRE",null,1210,null,387200,null,null,null,null,"Egyéb alaktrészek"]
[{"$f":"IF(L26=FALSE,0,COUNTIF(A$3:A25,\">0\")+1)","v":0},4153126607,"AKK 301-D","1 035,-€ ","AGRE",null,1100,null,352000]
[{"$f":"IF(L27=FALSE,0,COUNTIF(A$3:A26,\">0\")+1)","v":0},4153126614,"AEK 461-W","1 365,-€ ","AGRE",null,1450,null,464000]
[{"$f":"IF(L28=FALSE,0,COUNTIF(A$3:A27,\">0\")+1)","v":0},4153126617,"AEK 461-D","1 252,-€ ","AGRE",null,1330,null,425600]
[{"$f":"IF(L29=FALSE,0,COUNTIF(A$3:A28,\">0\")+1)","v":0},4153126618,"AEK 601","1 412,-€ ","AGRE",null,1500,null,480000]
[{"$f":"IF(L30=FALSE,0,COUNTIF(A$3:A29,\">0\")+1)","v":0},4153126402,"AGK-N-271","1 308,-€ ","AGRE",null,1390,null,444800]
[{"$f":"IF(L31=FALSE,0,COUNTIF(A$3:A30,\">0\")+1)","v":0},4153126611,"AGK-N-551","1 732,-€ ","AGRE",null,1840,null,588800]
[{"$f":"IF(L32=FALSE,0,COUNTIF(A$3:A31,\">0\")+1)","v":0},4153126604,"AEK 851","1 939,-€ ","AGRE",null,2060,null,659200]
[{"$f":"IF(L33=FALSE,0,COUNTIF(A$3:A32,\">0\")+1)","v":0},4153126401,"AGK-H-271","1 346,-€ ","AGRE",null,1430,null,457600]
[{"$f":"IF(L34=FALSE,0,COUNTIF(A$3:A33,\">0\")+1)","v":0},4153126610,"AGK-H-551","1 638,-€ ","AGRE",null,1740,null,556800]
[{"$f":"IF(L35=FALSE,0,COUNTIF(A$3:A34,\">0\")+1)","v":0},4153126608,"AGK-H-751","1 995,-€ ","AGRE",null,2120,null,678400]
[{"$f":"IF(L36=FALSE,0,COUNTIF(A$3:A35,\">0\")+1)","v":0},4153126612,"AKK-O-236-D","1 525,-€ ","AGRE",null,1620,null,518400]
[{"$f":"IF(L37=FALSE,0,COUNTIF(A$3:A36,\">0\")+1)","v":0},4153126400,"AGK-O-271","2 024,-€ ","AGRE",null,2150,null,688000]
[{"$f":"IF(L38=FALSE,0,COUNTIF(A$3:A37,\">0\")+1)","v":0},4153126613,"AGK-O-551","2 551,-€ ","AGRE",null,2710,null,867200]
[{"$f":"IF(L39=FALSE,0,COUNTIF(A$3:A38,\">0\")+1)","v":0},4153126606,"AGK-O-751","2 880,-€ ","AGRE",null,3060,null,979200]
[{"$f":"IF(L40=FALSE,0,COUNTIF(A$3:A39,\">0\")+1)","v":0},"AF 0056","Alumínium AF szűrőház -3/8’’",{"$f":"IF(H40=\"SP\",IF(J40>0,\"SP: \"&TEXT(J40*I$1,\"# ###,-Ft  \"),\"SP: \"&TEXT(I40*I$1,\"# ###,-Ft\")),IF(J40>0,\"*(\"&TEXT(I40*I$1,\"# ###,-\")&\") \n\"&TEXT(J40*J$1,\"# ###,-Ft\"),TEXT(I40*I$1,\"# ###,-Ft  \")))","v":"13 930,-Ft "},"OMEGA",null,50.531800000000004,null,13930]
[{"$f":"IF(L41=FALSE,0,COUNTIF(A$3:A40,\">0\")+1)","v":0},"AF 0076","Alumínium AF szűrőház -1/2’’",{"$f":"IF(H41=\"SP\",IF(J41>0,\"SP: \"&TEXT(J41*I$1,\"# ###,-Ft  \"),\"SP: \"&TEXT(I41*I$1,\"# ###,-Ft\")),IF(J41>0,\"*(\"&TEXT(I41*I$1,\"# ###,-\")&\") \n\"&TEXT(J41*J$1,\"# ###,-Ft\"),TEXT(I41*I$1,\"# ###,-Ft  \")))","v":"15 670,-Ft "},"OMEGA",null,56.825100000000006,null,15670]
[{"$f":"IF(L42=FALSE,0,COUNTIF(A$3:A41,\">0\")+1)","v":0},"AF 0106","Alumínium AF szűrőház -3/4’’","18 470,-Ft ","OMEGA",null,66.970600000000005,null,18470]
[{"$f":"IF(L43=FALSE,0,COUNTIF(A$3:A42,\">0\")+1)","v":0},"AF 0186","Alumínium AF szűrőház -1’’","26 470,-Ft ","OMEGA",null,95.985699999999994,null,26470]
[{"$f":"IF(L44=FALSE,0,COUNTIF(A$3:A43,\">0\")+1)","v":0},"AF 0306","Alumínium AF szűrőház -1’’","28 030,-Ft ","OMEGA",null,104.81280000000001,null,28030]
[{"$f":"IF(L45=FALSE,0,COUNTIF(A$3:A44,\">0\")+1)","v":0},"AF 0476","Alumínium AF szűrőház -1 1/2’’","33 110,-Ft ","OMEGA",null,123.7957,null,33110]
[{"$f":"IF(L46=FALSE,0,COUNTIF(A$3:A45,\">0\")+1)","v":0},"AF 0706","Alumínium AF szűrőház -1 1/2’’","39 520,-Ft ","OMEGA",null,147.7432,null,39520]
[{"$f":"IF(L47=FALSE,0,COUNTIF(A$3:A46,\">0\")+1)","v":0},"AF 0946","Alumínium AF szűrőház -2’’","67 910,-Ft ","OMEGA",null,253.87440000000001,null,67910]
[{"$f":"IF(L48=FALSE,0,COUNTIF(A$3:A47,\">0\")+1)","v":0},"AF 1506","Alumínium AF szűrőház -2’’","82 420,-Ft ","OMEGA",null,308.15540000000004,null,82420]
[{"$f":"IF(L49=FALSE,0,COUNTIF(A$3:A48,\">0\")+1)","v":0},"AF 1756","Alumínium AF szűrőház -2 1/2’’","135 210,-Ft ","OMEGA",null,521.65380000000005,null,135210]
[{"$f":"IF(L50=FALSE,0,COUNTIF(A$3:A49,\">0\")+1)","v":0},"AF 2006","Alumínium AF szűrőház -3","163 040,-Ft ","OMEGA",null,629.01070000000004,null,163040]
[{"$f":"IF(L51=FALSE,0,COUNTIF(A$3:A50,\">0\")+1)","v":0},"AF 2406","Alumínium AF szűrőház -3","201 360,-Ft ","OMEGA",null,776.8569,null,201360]
[{"$f":"IF(L52=FALSE,0,COUNTIF(A$3:A51,\">0\")+1)","v":0},"6050B","Szűrőbetét B -AF 0056","6 790,-Ft ","OMEGA",null,24.6067,null,6790]
[{"$f":"IF(L53=FALSE,0,COUNTIF(A$3:A52,\">0\")+1)","v":0},"7050B","Szűrőbetét B -AF 0076","8 400,-Ft ","OMEGA",null,30.4468,null,8400]
[{"$f":"IF(L54=FALSE,0,COUNTIF(A$3:A53,\">0\")+1)","v":0},"14050B","Szűrőbetét B -AF 0106","10 830,-Ft ","OMEGA",null,39.273900000000005,null,10830]
[{"$f":"IF(L55=FALSE,0,COUNTIF(A$3:A54,\">0\")+1)","v":0},"12075B","Szűrőbetét B -AF 0186","14 210,-Ft ","OMEGA",null,51.530900000000003,null,14210]
[{"$f":"IF(L56=FALSE,0,COUNTIF(A$3:A55,\">0\")+1)","v":0},"22075B","Szűrőbetét B -AF 0306","20 050,-Ft ","OMEGA",null,72.717999999999989,null,20050]
[{"$f":"IF(L57=FALSE,0,COUNTIF(A$3:A56,\">0\")+1)","v":0},"32075B","Szűrőbetét B -AF 0476","24 250,-Ft ","OMEGA",null,87.941400000000002,null,24250]
[{"$f":"IF(L58=FALSE,0,COUNTIF(A$3:A57,\">0\")+1)","v":0},"50075B","Szűrőbetét B -AF 0706","28 750,-Ft ","OMEGA",null,107.47020000000001,null,28750]
[{"$f":"IF(L59=FALSE,0,COUNTIF(A$3:A58,\">0\")+1)","v":0},"51090B","Szűrőbetét B -AF 0946","41 200,-Ft ","OMEGA",null,154.02619999999999,null,41200]
[{"$f":"IF(L60=FALSE,0,COUNTIF(A$3:A59,\">0\")+1)","v":0},"76090B","Szűrőbetét B -AF 1506","50 140,-Ft ","OMEGA",null,187.46,null,50140]
[{"$f":"IF(L61=FALSE,0,COUNTIF(A$3:A60,\">0\")+1)","v":0},"76090B","Szűrőbetét B -AF 1756","50 140,-Ft ","OMEGA",null,187.46,null,50140]
[{"$f":"IF(L62=FALSE,0,COUNTIF(A$3:A61,\">0\")+1)","v":0},"51140B","Szűrőbetét B -AF 2006","60 940,-Ft ","OMEGA",null,227.83599999999998,null,60940]
[{"$f":"IF(L63=FALSE,0,COUNTIF(A$3:A62,\">0\")+1)","v":0},"75140B","Szűrőbetét B -AF 2406","70 620,-Ft ","OMEGA",null,264.03019999999998,null,70620]
[{"$f":"IF(L64=FALSE,0,COUNTIF(A$3:A63,\">0\")+1)","v":0},"6050P","Szűrőbetét P -AF 0056","5 900,-Ft ","OMEGA",null,21.413699999999999,null,5900]
[{"$f":"IF(L65=FALSE,0,COUNTIF(A$3:A64,\">0\")+1)","v":0},"7050P","Szűrőbetét P -AF 0076","7 300,-Ft ","OMEGA",null,26.481300000000001,null,7300]
[{"$f":"IF(L66=FALSE,0,COUNTIF(A$3:A65,\">0\")+1)","v":0},"14050P","Szűrőbetét P -AF 0106","9 400,-Ft ","OMEGA",null,34.093000000000004,null,9400]
[{"$f":"IF(L67=FALSE,0,COUNTIF(A$3:A66,\">0\")+1)","v":0},"12075P","Szűrőbetét P -AF 0186","11 840,-Ft ","OMEGA",null,42.920100000000005,null,11840]
[{"$f":"IF(L68=FALSE,0,COUNTIF(A$3:A67,\">0\")+1)","v":0},"22075P","Szűrőbetét P -AF 0306","16 700,-Ft ","OMEGA",null,60.574300000000001,null,16700]
[{"$f":"IF(L69=FALSE,0,COUNTIF(A$3:A68,\">0\")+1)","v":0},"32075P","Szűrőbetét P -AF 0476","20 200,-Ft ","OMEGA",null,73.263899999999992,null,20200]
[{"$f":"IF(L70=FALSE,0,COUNTIF(A$3:A69,\">0\")+1)","v":0},"50075P","Szűrőbetét P -AF 0706","25 770,-Ft ","OMEGA",null,93.451900000000009,null,25770]
[{"$f":"IF(L71=FALSE,0,COUNTIF(A$3:A70,\">0\")+1)","v":0},"51090P","Szűrőbetét P -AF 0946","35 800,-Ft ","OMEGA",null,133.8279,null,35800]
[{"$f":"IF(L72=FALSE,0,COUNTIF(A$3:A71,\">0\")+1)","v":0},"76090P","Szűrőbetét P -AF 1506","43 590,-Ft ","OMEGA",null,162.9666,null,43590]
[{"$f":"IF(L73=FALSE,0,COUNTIF(A$3:A72,\">0\")+1)","v":0},"76090P","Szűrőbetét P -AF 1756","43 590,-Ft ","OMEGA",null,162.9666,null,43590]
[{"$f":"IF(L74=FALSE,0,COUNTIF(A$3:A73,\">0\")+1)","v":0},"51140P","Szűrőbetét P -AF 2006","55 390,-Ft ","OMEGA",null,207.10210000000001,null,55390]
[{"$f":"IF(L75=FALSE,0,COUNTIF(A$3:A74,\">0\")+1)","v":0},"75140P","Szűrőbetét P -AF 2406","64 190,-Ft ","OMEGA",null,239.97970000000001,null,64190]
[{"$f":"IF(L76=FALSE,0,COUNTIF(A$3:A75,\">0\")+1)","v":0},"6050R","Szűrőbetét R -AF 0056","5 900,-Ft ","OMEGA",null,21.413699999999999,null,5900]
[{"$f":"IF(L77=FALSE,0,COUNTIF(A$3:A76,\">0\")+1)","v":0},"7050R","Szűrőbetét R -AF 0076","7 300,-Ft ","OMEGA",null,26.481300000000001,null,7300]
[{"$f":"IF(L78=FALSE,0,COUNTIF(A$3:A77,\">0\")+1)","v":0},"14050R","Szűrőbetét R -AF 0106","9 400,-Ft ","OMEGA",null,34.093000000000004,null,9400]
[{"$f":"IF(L79=FALSE,0,COUNTIF(A$3:A78,\">0\")+1)","v":0},"12075R","Szűrőbetét R -AF 0186","11 840,-Ft ","OMEGA",null,42.920100000000005,null,11840]
[{"$f":"IF(L80=FALSE,0,COUNTIF(A$3:A79,\">0\")+1)","v":0},"22075R","Szűrőbetét R -AF 0306","16 700,-Ft ","OMEGA",null,60.574300000000001,null,16700]
[{"$f":"IF(L81=FALSE,0,COUNTIF(A$3:A80,\">0\")+1)","v":0},"32075R","Szűrőbetét R -AF 0476","20 200,-Ft ","OMEGA",null,73.263899999999992,null,20200]
[{"$f":"IF(L82=FALSE,0,COUNTIF(A$3:A81,\">0\")+1)","v":0},"50075R","Szűrőbetét R -AF 0706","25 770,-Ft ","OMEGA",null,93.451900000000009,null,25770]
[{"$f":"IF(L83=FALSE,0,COUNTIF(A$3:A82,\">0\")+1)","v":0},"51090R","Szűrőbetét R -AF 0946","35 800,-Ft ","OMEGA",null,133.8279,null,35800]
[{"$f":"IF(L84=FALSE,0,COUNTIF(A$3:A83,\">0\")+1)","v":0},"76090R","Szűrőbetét R -AF 1506","43 590,-Ft ","OMEGA",null,162.9666,null,43590]
[{"$f":"IF(L85=FALSE,0,COUNTIF(A$3:A84,\">0\")+1)","v":0},"76090R","Szűrőbetét R -AF 1756","43 590,-Ft ","OMEGA",null,162.9666,null,43590]
[{"$f":"IF(L86=FALSE,0,COUNTIF(A$3:A85,\">0\")+1)","v":0},"51140R","Szűrőbetét R -AF 2006","55 390,-Ft ","OMEGA",null,207.10210000000001,null,55390]
[{"$f":"IF(L87=FALSE,0,COUNTIF(A$3:A86,\">0\")+1)","v":0},"75140R","Szűrőbetét R -AF 2406","64 190,-Ft ","OMEGA",null,239.97970000000001,null,64190]
[{"$f":"IF(L88=FALSE,0,COUNTIF(A$3:A87,\">0\")+1)","v":0},"6050M","Szűrőbetét M -AF 0056","5 900,-Ft ","OMEGA",null,21.413699999999999,null,5900]
[{"$f":"IF(L89=FALSE,0,COUNTIF(A$3:A88,\">0\")+1)","v":0},"7050M","Szűrőbetét M -AF 0076","7 300,-Ft ","OMEGA",null,26.481300000000001,null,7300]
[{"$f":"IF(L90=FALSE,0,COUNTIF(A$3:A89,\">0\")+1)","v":0},"14050M","Szűrőbetét M -AF 0106","9 400,-Ft ","OMEGA",null,34.093000000000004,null,9400]
[{"$f":"IF(L91=FALSE,0,COUNTIF(A$3:A90,\">0\")+1)","v":0},"12075M","Szűrőbetét M -AF 0186","11 840,-Ft ","OMEGA",null,42.920100000000005,null,11840]
[{"$f":"IF(L92=FALSE,0,COUNTIF(A$3:A91,\">0\")+1)","v":0},"22075M","Szűrőbetét M -AF 0306","16 700,-Ft ","OMEGA",null,60.574300000000001,null,16700]
[{"$f":"IF(L93=FALSE,0,COUNTIF(A$3:A92,\">0\")+1)","v":0},"32075M","Szűrőbetét M -AF 0476","20 200,-Ft ","OMEGA",null,73.263899999999992,null,20200]
[{"$f":"IF(L94=FALSE,0,COUNTIF(A$3:A93,\">0\")+1)","v":0},"50075M","Szűrőbetét M -AF 0706","25 770,-Ft ","OMEGA",null,93.451900000000009,null,25770]
[{"$f":"IF(L95=FALSE,0,COUNTIF(A$3:A94,\">0\")+1)","v":0},"51090M","Szűrőbetét M -AF 0946","35 800,-Ft ","OMEGA",null,133.8279,null,35800]
[{"$f":"IF(L96=FALSE,0,COUNTIF(A$3:A95,\">0\")+1)","v":0},"76090M","Szűrőbetét M -AF 1506","43 590,-Ft ","OMEGA",null,162.9666,null,43590]
[{"$f":"IF(L97=FALSE,0,COUNTIF(A$3:A96,\">0\")+1)","v":0},"76090M","Szűrőbetét M -AF 1756","43 590,-Ft ","OMEGA",null,162.9666,null,43590]
[{"$f":"IF(L98=FALSE,0,COUNTIF(A$3:A97,\">0\")+1)","v":0},"51140M","Szűrőbetét M -AF 2006","55 390,-Ft ","OMEGA",null,207.10210000000001,null,55390]
[{"$f":"IF(L99=FALSE,0,COUNTIF(A$3:A98,\">0\")+1)","v":0},"75140M","Szűrőbetét M -AF 2406","64 190,-Ft ","OMEGA",null,239.97970000000001,null,64190]
[{"$f":"IF(L100=FALSE,0,COUNTIF(A$3:A99,\">0\")+1)","v":0},"6050S","Szűrőbetét S -AF 0056","5 900,-Ft ","OMEGA",null,21.413699999999999,null,5900]
[{"$f":"IF(L101=FALSE,0,COUNTIF(A$3:A100,\">0\")+1)","v":0},"7050S","Szűrőbetét S -AF 0076","7 300,-Ft ","OMEGA",null,26.481300000000001,null,7300]
[{"$f":"IF(L102=FALSE,0,COUNTIF(A$3:A101,\">0\")+1)","v":0},"14050S","Szűrőbetét S -AF 0106","9 400,-Ft ","OMEGA",null,34.093000000000004,null,9400]
[{"$f":"IF(L103=FALSE,0,COUNTIF(A$3:A102,\">0\")+1)","v":0},"12075S","Szűrőbetét S -AF 0186","11 840,-Ft ","OMEGA",null,42.920100000000005,null,11840]
[{"$f":"IF(L104=FALSE,0,COUNTIF(A$3:A103,\">0\")+1)","v":0},"22075S","Szűrőbetét S -AF 0306","16 700,-Ft ","OMEGA",null,60.574300000000001,null,16700]
[{"$f":"IF(L105=FALSE,0,COUNTIF(A$3:A104,\">0\")+1)","v":0},"32075S","Szűrőbetét S -AF 0476",{"$f":"IF(H105=\"SP\",IF(J105>0,\"SP: \"&TEXT(J105*I$1,\"# ###,-Ft  \"),\"SP: \"&TEXT(I105*I$1,\"# ###,-Ft\")),IF(J105>0,\"*(\"&TEXT(I105*I$1,\"# ###,-\")&\") \n\"&TEXT(J105*J$1,\"# ###,-Ft\"),TEXT(I105*I$1,\"# ###,-Ft  \")))","v":"20 200,-Ft "},"OMEGA",null,73.263899999999992,null,20200]
[{"$f":"IF(L106=FALSE,0,COUNTIF(A$3:A105,\">0\")+1)","v":0},"50075S","Szűrőbetét S -AF 0706","25 770,-Ft ","OMEGA",null,93.451900000000009,null,25770]
[{"$f":"IF(L107=FALSE,0,COUNTIF(A$3:A106,\">0\")+1)","v":0},"51090S","Szűrőbetét S -AF 0946","35 800,-Ft ","OMEGA",null,133.8279,null,35800]
[{"$f":"IF(L108=FALSE,0,COUNTIF(A$3:A107,\">0\")+1)","v":0},"76090S","Szűrőbetét S -AF 1506","43 590,-Ft ","OMEGA",null,162.9666,null,43590]
[{"$f":"IF(L109=FALSE,0,COUNTIF(A$3:A108,\">0\")+1)","v":0},"76090S","Szűrőbetét S -AF 1756","43 590,-Ft ","OMEGA",null,162.9666,null,43590]
[{"$f":"IF(L110=FALSE,0,COUNTIF(A$3:A109,\">0\")+1)","v":0},"51140S","Szűrőbetét S -AF 2006","55 390,-Ft ","OMEGA",null,207.10210000000001,null,55390]
[{"$f":"IF(L111=FALSE,0,COUNTIF(A$3:A110,\">0\")+1)","v":0},"75140S","Szűrőbetét S -AF 2406","64 190,-Ft ","OMEGA",null,239.97970000000001,null,64190]
[{"$f":"IF(L112=FALSE,0,COUNTIF(A$3:A111,\">0\")+1)","v":0},"6050A","Szűrőbetét A -AF 0056","5 900,-Ft ","OMEGA",null,21.413699999999999,null,5900]
[{"$f":"IF(L113=FALSE,0,COUNTIF(A$3:A112,\">0\")+1)","v":0},"7050A","Szűrőbetét A -AF 0076","7 300,-Ft ","OMEGA",null,26.481300000000001,null,7300]
[{"$f":"IF(L114=FALSE,0,COUNTIF(A$3:A113,\">0\")+1)","v":0},"14050A","Szűrőbetét A -AF 0106","9 400,-Ft ","OMEGA",null,34.093000000000004,null,9400]
[{"$f":"IF(L115=FALSE,0,COUNTIF(A$3:A114,\">0\")+1)","v":0},"12075A","Szűrőbetét A -AF 0186","11 840,-Ft ","OMEGA",null,42.920100000000005,null,11840]
[{"$f":"IF(L116=FALSE,0,COUNTIF(A$3:A115,\">0\")+1)","v":0},"22075A","Szűrőbetét A -AF 0306","16 700,-Ft ","OMEGA",null,60.574300000000001,null,16700]
[{"$f":"IF(L117=FALSE,0,COUNTIF(A$3:A116,\">0\")+1)","v":0},"32075A","Szűrőbetét A -AF 0476","20 200,-Ft ","OMEGA",null,73.263899999999992,null,20200]
[{"$f":"IF(L118=FALSE,0,COUNTIF(A$3:A117,\">0\")+1)","v":0},"50075A","Szűrőbetét A -AF 0706","25 770,-Ft ","OMEGA",null,93.451900000000009,null,25770]
[{"$f":"IF(L119=FALSE,0,COUNTIF(A$3:A118,\">0\")+1)","v":0},"51090A","Szűrőbetét A -AF 0946","35 800,-Ft ","OMEGA",null,133.8279,null,35800]
[{"$f":"IF(L120=FALSE,0,COUNTIF(A$3:A119,\">0\")+1)","v":0},"76090A","Szűrőbetét A -AF 1506","43 590,-Ft ","OMEGA",null,162.9666,null,43590]
[{"$f":"IF(L121=FALSE,0,COUNTIF(A$3:A120,\">0\")+1)","v":0},"76090A","Szűrőbetét A -AF 1756","43 590,-Ft ","OMEGA",null,162.9666,null,43590]
[{"$f":"IF(L122=FALSE,0,COUNTIF(A$3:A121,\">0\")+1)","v":0},"51140A","Szűrőbetét A -AF 2006","55 390,-Ft ","OMEGA",null,207.10210000000001,null,55390]
[{"$f":"IF(L123=FALSE,0,COUNTIF(A$3:A122,\">0\")+1)","v":0},"75140A","Szűrőbetét A -AF 2406","64 190,-Ft ","OMEGA",null,239.97970000000001,null,64190]
[{"$f":"IF(L124=FALSE,0,COUNTIF(A$3:A123,\">0\")+1)","v":0},"7050A²","Szűrőbetét A2 -AF 0076","21 150,-Ft ","OMEGA",null,76.683500000000009,null,21150]
[{"$f":"IF(L125=FALSE,0,COUNTIF(A$3:A124,\">0\")+1)","v":0},"14050A²","Szűrőbetét A2 -AF 0106","23 370,-Ft ","OMEGA",null,84.738100000000003,null,23370]
[{"$f":"IF(L126=FALSE,0,COUNTIF(A$3:A125,\">0\")+1)","v":0},"12075A²","Szűrőbetét A2 -AF 0186","28 650,-Ft ","OMEGA",null,107.13030000000001,null,28650]
[{"$f":"IF(L127=FALSE,0,COUNTIF(A$3:A126,\">0\")+1)","v":0},"22075A²","Szűrőbetét A2 -AF 0306","32 230,-Ft ","OMEGA",null,120.4894,null,32230]
[{"$f":"IF(L128=FALSE,0,COUNTIF(A$3:A127,\">0\")+1)","v":0},"32075A²","Szűrőbetét A2 -AF 0476","35 240,-Ft ","OMEGA",null,131.7473,null,35240]
[{"$f":"IF(L129=FALSE,0,COUNTIF(A$3:A128,\">0\")+1)","v":0},"50075A²","Szűrőbetét A2 -AF 0706","39 690,-Ft ","OMEGA",null,148.40240000000003,null,39690]
[{"$f":"IF(L130=FALSE,0,COUNTIF(A$3:A129,\">0\")+1)","v":0},"7050H²","Szűrőbetét H2 -AF 0076","24 310,-Ft ","OMEGA",null,88.157700000000006,null,24310]
[{"$f":"IF(L131=FALSE,0,COUNTIF(A$3:A130,\">0\")+1)","v":0},"14050H²","Szűrőbetét H2 -AF 0106","31 130,-Ft ","OMEGA",null,116.4003,null,31130]
[{"$f":"IF(L132=FALSE,0,COUNTIF(A$3:A131,\">0\")+1)","v":0},"12075H²","Szűrőbetét H2 -AF 0186","38 310,-Ft ","OMEGA",null,143.21119999999999,null,38310]
[{"$f":"IF(L133=FALSE,0,COUNTIF(A$3:A132,\">0\")+1)","v":0},"22075H²","Szűrőbetét H2 -AF 0306","60 730,-Ft ","OMEGA",null,227.0635,null,60730]
[{"$f":"IF(L134=FALSE,0,COUNTIF(A$3:A133,\">0\")+1)","v":0},"32075H²","Szűrőbetét H2 -AF 0476","84 110,-Ft ","OMEGA",null,314.44870000000003,null,84110]
[{"$f":"IF(L135=FALSE,0,COUNTIF(A$3:A134,\">0\")+1)","v":0},"50075H²","Szűrőbetét H2 -AF 0706","130 130,-Ft ","OMEGA",null,502.02199999999999,null,130130]
[{"$f":"IF(L136=FALSE,0,COUNTIF(A$3:A135,\">0\")+1)","v":0},"7050MS²","Szűrőbetét MS2 -AF 0076","22 070,-Ft ","OMEGA",null,80.020700000000005,null,22070]
[{"$f":"IF(L137=FALSE,0,COUNTIF(A$3:A136,\">0\")+1)","v":0},"14050MS²","Szűrőbetét MS2 -AF 0106","26 410,-Ft ","OMEGA",null,98.725499999999997,null,26410]
[{"$f":"IF(L138=FALSE,0,COUNTIF(A$3:A137,\">0\")+1)","v":0},"12075MS²","Szűrőbetét MS2 -AF 0186","33 390,-Ft ","OMEGA",null,124.81540000000001,null,33390]
[{"$f":"IF(L139=FALSE,0,COUNTIF(A$3:A138,\">0\")+1)","v":0},"22075MS²","Szűrőbetét MS2 -AF 0306","37 550,-Ft ","OMEGA",null,140.36840000000001,null,37550]
[{"$f":"IF(L140=FALSE,0,COUNTIF(A$3:A139,\">0\")+1)","v":0},"32075MS²","Szűrőbetét MS2 -AF 0476","41 050,-Ft ","OMEGA",null,153.4906,null,41050]
[{"$f":"IF(L141=FALSE,0,COUNTIF(A$3:A140,\">0\")+1)","v":0},"50075MS²","Szűrőbetét MS2 -AF 0706","46 250,-Ft ","OMEGA",null,172.89580000000001,null,46250]
[{"$f":"IF(L142=FALSE,0,COUNTIF(A$3:A141,\">0\")+1)","v":0},"AAF 0016","Alumínium AFF szűrőház -1/8''","15 180,-Ft ","OMEGA",null,55.063800000000001,null,15180]
[{"$f":"IF(L143=FALSE,0,COUNTIF(A$3:A142,\">0\")+1)","v":0},"AAF 0026","Alumínium AFF szűrőház -1/4''","16 560,-Ft ","OMEGA",null,60.048999999999999,null,16560]
[{"$f":"IF(L144=FALSE,0,COUNTIF(A$3:A143,\">0\")+1)","v":0},"AAF 0036","Alumínium AFF szűrőház -3/8''","17 410,-Ft ","OMEGA",null,63.128700000000002,null,17410]
[{"$f":"IF(L145=FALSE,0,COUNTIF(A$3:A144,\">0\")+1)","v":0},"AAF 0046","Alumínium AFF szűrőház -1/4''","19 480,-Ft ","OMEGA",null,70.658000000000001,null,19480]
[{"$f":"IF(L146=FALSE,0,COUNTIF(A$3:A145,\">0\")+1)","v":0},"AAF 0056","Alumínium AFF szűrőház -3/8''","20 450,-Ft ","OMEGA",null,74.16,null,20450]
[{"$f":"IF(L147=FALSE,0,COUNTIF(A$3:A146,\">0\")+1)","v":0},"AAF 0076","Alumínium AFF szűrőház -1/2''","21 800,-Ft ","OMEGA",null,79.042199999999994,null,21800]
[{"$f":"IF(L148=FALSE,0,COUNTIF(A$3:A147,\">0\")+1)","v":0},"AAF 0106","Alumínium AFF szűrőház -3/4''","23 370,-Ft ","OMEGA",null,84.769000000000005,null,23370]
[{"$f":"IF(L149=FALSE,0,COUNTIF(A$3:A148,\">0\")+1)","v":0},"3528AA-P","Szűrőbetét P -AAF 0016","5 530,-Ft ","OMEGA",null,20.054099999999998,null,5530]
[{"$f":"IF(L150=FALSE,0,COUNTIF(A$3:A149,\">0\")+1)","v":0},"3844AA-P","Szűrőbetét P -AAF 0026","5 710,-Ft ","OMEGA",null,20.692700000000002,null,5710]
[{"$f":"IF(L151=FALSE,0,COUNTIF(A$3:A150,\">0\")+1)","v":0},"3844AA-P","Szűrőbetét P -AAF 0036","5 710,-Ft ","OMEGA",null,20.692700000000002,null,5710]
[{"$f":"IF(L152=FALSE,0,COUNTIF(A$3:A151,\">0\")+1)","v":0},"6050AA-P","Szűrőbetét P -AAF 0046","5 900,-Ft ","OMEGA",null,21.413699999999999,null,5900]
[{"$f":"IF(L153=FALSE,0,COUNTIF(A$3:A152,\">0\")+1)","v":0},"6050AA-P","Szűrőbetét P -AAF 0056","5 900,-Ft ","OMEGA",null,21.413699999999999,null,5900]
[{"$f":"IF(L154=FALSE,0,COUNTIF(A$3:A153,\">0\")+1)","v":0},"7050AA-P","Szűrőbetét P -AAF 0076","7 300,-Ft ","OMEGA",null,26.481300000000001,null,7300]
[{"$f":"IF(L155=FALSE,0,COUNTIF(A$3:A154,\">0\")+1)","v":0},"14050AA-P","Szűrőbetét P -AAF 0106","9 400,-Ft ","OMEGA",null,34.093000000000004,null,9400]
[{"$f":"IF(L156=FALSE,0,COUNTIF(A$3:A155,\">0\")+1)","v":0},"3528AA-R","Szűrőbetét R -AAF 0016","5 530,-Ft ","OMEGA",null,20.054099999999998,null,5530]
[{"$f":"IF(L157=FALSE,0,COUNTIF(A$3:A156,\">0\")+1)","v":0},"3844AA-R","Szűrőbetét R -AAF 0026","5 710,-Ft ","OMEGA",null,20.692700000000002,null,5710]
[{"$f":"IF(L158=FALSE,0,COUNTIF(A$3:A157,\">0\")+1)","v":0},"3844AA-R","Szűrőbetét R -AAF 0036","5 710,-Ft ","OMEGA",null,20.692700000000002,null,5710]
[{"$f":"IF(L159=FALSE,0,COUNTIF(A$3:A158,\">0\")+1)","v":0},"6050AA-R","Szűrőbetét R -AAF 0046","5 900,-Ft ","OMEGA",null,21.413699999999999,null,5900]
[{"$f":"IF(L160=FALSE,0,COUNTIF(A$3:A159,\">0\")+1)","v":0},"6050AA-R","Szűrőbetét R -AAF 0056","5 900,-Ft ","OMEGA",null,21.413699999999999,null,5900]
[{"$f":"IF(L161=FALSE,0,COUNTIF(A$3:A160,\">0\")+1)","v":0},"7050AA-R","Szűrőbetét R -AAF 0076","7 300,-Ft ","OMEGA",null,26.481300000000001,null,7300]
[{"$f":"IF(L162=FALSE,0,COUNTIF(A$3:A161,\">0\")+1)","v":0},"14050AA-R","Szűrőbetét R -AAF 0106","9 400,-Ft ","OMEGA",null,34.093000000000004,null,9400]
[{"$f":"IF(L163=FALSE,0,COUNTIF(A$3:A162,\">0\")+1)","v":0},"3528AA-M","Szűrőbetét M -AAF 0016","5 530,-Ft ","OMEGA",null,20.054099999999998,null,5530]
[{"$f":"IF(L164=FALSE,0,COUNTIF(A$3:A163,\">0\")+1)","v":0},"3844AA-M","Szűrőbetét M -AAF 0026","5 710,-Ft ","OMEGA",null,20.692700000000002,null,5710]
[{"$f":"IF(L165=FALSE,0,COUNTIF(A$3:A164,\">0\")+1)","v":0},"3844AA-M","Szűrőbetét M -AAF 0036","5 710,-Ft ","OMEGA",null,20.692700000000002,null,5710]
[{"$f":"IF(L166=FALSE,0,COUNTIF(A$3:A165,\">0\")+1)","v":0},"6050AA-M","Szűrőbetét M -AAF 0046","5 900,-Ft ","OMEGA",null,21.413699999999999,null,5900]
[{"$f":"IF(L167=FALSE,0,COUNTIF(A$3:A166,\">0\")+1)","v":0},"6050AA-M","Szűrőbetét M -AAF 0056","5 900,-Ft ","OMEGA",null,21.413699999999999,null,5900]
[{"$f":"IF(L168=FALSE,0,COUNTIF(A$3:A167,\">0\")+1)","v":0},"7050AA-M","Szűrőbetét M -AAF 0076","7 300,-Ft ","OMEGA",null,26.481300000000001,null,7300]
[{"$f":"IF(L169=FALSE,0,COUNTIF(A$3:A168,\">0\")+1)","v":0},"14050AA-M","Szűrőbetét M -AAF 0106",{"$f":"IF(H169=\"SP\",IF(J169>0,\"SP: \"&TEXT(J169*I$1,\"# ###,-Ft  \"),\"SP: \"&TEXT(I169*I$1,\"# ###,-Ft\")),IF(J169>0,\"*(\"&TEXT(I169*I$1,\"# ###,-\")&\") \n\"&TEXT(J169*J$1,\"# ###,-Ft\"),TEXT(I169*I$1,\"# ###,-Ft  \")))","v":"9 400,-Ft "},"OMEGA",null,34.093000000000004,null,9400]
[{"$f":"IF(L170=FALSE,0,COUNTIF(A$3:A169,\">0\")+1)","v":0},"3528AA-S","Szűrőbetét S -AAF 0016","5 530,-Ft ","OMEGA",null,20.054099999999998,null,5530]
[{"$f":"IF(L171=FALSE,0,COUNTIF(A$3:A170,\">0\")+1)","v":0},"3844AA-S","Szűrőbetét S -AAF 0026","5 710,-Ft ","OMEGA",null,20.692700000000002,null,5710]
[{"$f":"IF(L172=FALSE,0,COUNTIF(A$3:A171,\">0\")+1)","v":0},"3844AA-S","Szűrőbetét S -AAF 0036","5 710,-Ft ","OMEGA",null,20.692700000000002,null,5710]
[{"$f":"IF(L173=FALSE,0,COUNTIF(A$3:A172,\">0\")+1)","v":0},"6050AA-S","Szűrőbetét S -AAF 0046","5 900,-Ft ","OMEGA",null,21.413699999999999,null,5900]
[{"$f":"IF(L174=FALSE,0,COUNTIF(A$3:A173,\">0\")+1)","v":0},"6050AA-S","Szűrőbetét S -AAF 0056","5 900,-Ft ","OMEGA",null,21.413699999999999,null,5900]
[{"$f":"IF(L175=FALSE,0,COUNTIF(A$3:A174,\">0\")+1)","v":0},"7050AA-S","Szűrőbetét S -AAF 0076","7 300,-Ft ","OMEGA",null,26.481300000000001,null,7300]
[{"$f":"IF(L176=FALSE,0,COUNTIF(A$3:A175,\">0\")+1)","v":0},"14050AA-S","Szűrőbetét S -AAF 0106","9 400,-Ft ","OMEGA",null,34.093000000000004,null,9400]
[{"$f":"IF(L177=FALSE,0,COUNTIF(A$3:A176,\">0\")+1)","v":0},"3528AA-A","Szűrőbetét A -AAF 0016","5 530,-Ft ","OMEGA",null,20.054099999999998,null,5530]
[{"$f":"IF(L178=FALSE,0,COUNTIF(A$3:A177,\">0\")+1)","v":0},"3844AA-A","Szűrőbetét A -AAF 0026","5 710,-Ft ","OMEGA",null,20.692700000000002,null,5710]
[{"$f":"IF(L179=FALSE,0,COUNTIF(A$3:A178,\">0\")+1)","v":0},"3844AA-A","Szűrőbetét A -AAF 0036","5 710,-Ft ","OMEGA",null,20.692700000000002,null,5710]
[{"$f":"IF(L180=FALSE,0,COUNTIF(A$3:A179,\">0\")+1)","v":0},"6050AA-A","Szűrőbetét A -AAF 0046","5 900,-Ft ","OMEGA",null,21.413699999999999,null,5900]
[{"$f":"IF(L181=FALSE,0,COUNTIF(A$3:A180,\">0\")+1)","v":0},"6050AA-A","Szűrőbetét A -AAF 0056","5 900,-Ft ","OMEGA",null,21.413699999999999,null,5900]
[{"$f":"IF(L182=FALSE,0,COUNTIF(A$3:A181,\">0\")+1)","v":0},"7050AA-A","Szűrőbetét A -AAF 0076","7 300,-Ft ","OMEGA",null,26.481300000000001,null,7300]
[{"$f":"IF(L183=FALSE,0,COUNTIF(A$3:A182,\">0\")+1)","v":0},"14050AA-A","Szűrőbetét A -AAF 0106","9 400,-Ft ","OMEGA",null,34.093000000000004,null,9400]
[{"$f":"IF(L184=FALSE,0,COUNTIF(A$3:A183,\">0\")+1)","v":0},"3528CKL-AAF","Szűrőbetét CKL-AAF -AAF 0016","5 440,-Ft ","OMEGA",null,19.7348,null,5440]
[{"$f":"IF(L185=FALSE,0,COUNTIF(A$3:A184,\">0\")+1)","v":0},"3844CKL-AAF","Szűrőbetét CKL-AAF -AAF 0026","5 590,-Ft ","OMEGA",null,20.260100000000001,null,5590]
[{"$f":"IF(L186=FALSE,0,COUNTIF(A$3:A185,\">0\")+1)","v":0},"3844CKL-AAF","Szűrőbetét CKL-AAF -AAF 0036","5 590,-Ft ","OMEGA",null,20.260100000000001,null,5590]
[{"$f":"IF(L187=FALSE,0,COUNTIF(A$3:A186,\">0\")+1)","v":0},"6050CKL-AAF","Szűrőbetét CKL-AAF -AAF 0046","5 720,-Ft ","OMEGA",null,20.744200000000003,null,5720]
[{"$f":"IF(L188=FALSE,0,COUNTIF(A$3:A187,\">0\")+1)","v":0},"6050CKL-AAF","Szűrőbetét CKL-AAF -AAF 0056","5 720,-Ft ","OMEGA",null,20.744200000000003,null,5720]
[{"$f":"IF(L189=FALSE,0,COUNTIF(A$3:A188,\">0\")+1)","v":0},"7050CKL-AAF","Szűrőbetét CKL-AAF -AAF 0076","5 720,-Ft ","OMEGA",null,20.744200000000003,null,5720]
[{"$f":"IF(L190=FALSE,0,COUNTIF(A$3:A189,\">0\")+1)","v":0},"14050CKL-AAF","Szűrőbetét CKL-AAF -AAF 0106","7 060,-Ft ","OMEGA",null,25.616100000000003,null,7060]
[{"$f":"IF(L191=FALSE,0,COUNTIF(A$3:A190,\">0\")+1)","v":0},"MCD-B","Kond. leeresztő manuális  0-16bar","2 020,-Ft ","OMEGA",null,7.3233000000000006,null,2020]
[{"$f":"IF(L192=FALSE,0,COUNTIF(A$3:A191,\">0\")+1)","v":0},"MCD","Kond. leeresztő manuális 0-20bar","2 620,-Ft ","OMEGA",null,9.4863000000000017,null,2620]
[{"$f":"IF(L193=FALSE,0,COUNTIF(A$3:A192,\">0\")+1)","v":0},"AOK16B","Belső Kond. leeresztő automata  0-16bar","7 060,-Ft ","OMEGA",null,25.595500000000001,null,7060]
[{"$f":"IF(L194=FALSE,0,COUNTIF(A$3:A193,\">0\")+1)","v":0},"AOK 20B","Kond. leeresztő automata gömb  0-20bar","11 130,-Ft ","OMEGA",null,40.376000000000005,null,11130]
[{"$f":"IF(L195=FALSE,0,COUNTIF(A$3:A194,\">0\")+1)","v":0},"TD 16M","Idővezérelt mágnesszelep leürítő","21 150,-Ft ","OMEGA",null,76.683500000000009,null,21150]
[{"$f":"IF(L196=FALSE,0,COUNTIF(A$3:A195,\">0\")+1)","v":0},"TD 25M","Idővezérelt mágnesszelep leürítő 25 bar","29 160,-Ft ","OMEGA",null,109.00490000000001,null,29160]
[{"$f":"IF(L197=FALSE,0,COUNTIF(A$3:A196,\">0\")+1)","v":0},"TD 16Mcr","Idővezérelt mágnesszelep leürítő","36 500,-Ft ","OMEGA",null,136.47499999999999,null,36500]
[{"$f":"IF(L198=FALSE,0,COUNTIF(A$3:A197,\">0\")+1)","v":0},"IED","Idővezérelt mágnesszelep leürítő","24 110,-Ft ","OMEGA",null,87.447000000000003,null,24110]
[{"$f":"IF(L199=FALSE,0,COUNTIF(A$3:A198,\">0\")+1)","v":0},"CDI 16B","Kondenzátum leeresztő","39 520,-Ft ","OMEGA",null,147.7432,null,39520]
[{"$f":"IF(L200=FALSE,0,COUNTIF(A$3:A199,\">0\")+1)","v":0},"EMD 15B","Elektronikus kondenzátum leeresztő","46 160,-Ft ","OMEGA",null,172.56620000000001,null,46160]
[{"$f":"IF(L201=FALSE,0,COUNTIF(A$3:A200,\">0\")+1)","v":0},"EMD 40B","Elektronikus kondenzátum leeresztő","47 100,-Ft ","OMEGA",null,176.08880000000002,null,47100]
[{"$f":"IF(L202=FALSE,0,COUNTIF(A$3:A201,\">0\")+1)","v":0},"EMD 90B","Elektronikus kondenzátum leeresztő","39 520,-Ft ","OMEGA",null,147.7432,null,39520]
[{"$f":"IF(L203=FALSE,0,COUNTIF(A$3:A202,\">0\")+1)","v":0},"ECD 150B","Elektronikus kondenzátum leeresztő","58 200,-Ft ","OMEGA",null,217.5772,null,58200]
[{"$f":"IF(L204=FALSE,0,COUNTIF(A$3:A203,\">0\")+1)","v":0},"EMD 12","Elektronikus kondenzátum leeresztő 24/115/230V","33 630,-Ft ","OMEGA",null,125.7218,null,33630]
[{"$f":"IF(L205=FALSE,0,COUNTIF(A$3:A204,\">0\")+1)","v":0},"EMD 12A","Elektronikus kondenzátum leeresztő 115/230V","36 290,-Ft ","OMEGA",null,135.69220000000001,null,36290]
[{"$f":"IF(L206=FALSE,0,COUNTIF(A$3:A205,\">0\")+1)","v":0},"EMD 12C","Elektronikus kondenzátum leeresztő 115/230V","39 470,-Ft ","OMEGA",null,147.56810000000002,null,39470]
[{"$f":"IF(L207=FALSE,0,COUNTIF(A$3:A206,\">0\")+1)","v":0},"EMD 25","Elektronikus kondenzátum leeresztő 115/230V","41 930,-Ft ","OMEGA",null,156.76599999999999,null,41930]
[{"$f":"IF(L208=FALSE,0,COUNTIF(A$3:A207,\">0\")+1)","v":0},"EMD 75","Elektronikus kondenzátum leeresztő 115/230V","43 120,-Ft ","OMEGA",null,161.19499999999999,null,43120]
[{"$f":"IF(L209=FALSE,0,COUNTIF(A$3:A208,\">0\")+1)","v":0},"EMD 12SK","Elektronikus kond. leer. szerviz kit","23 830,-Ft ","OMEGA",null,86.417000000000002,null,23830]
[{"$f":"IF(L210=FALSE,0,COUNTIF(A$3:A209,\">0\")+1)","v":0},"EMD 25SK","Elektronikus kond. leer. szerviz kit","23 830,-Ft ","OMEGA",null,86.417000000000002,null,23830]
[{"$f":"IF(L211=FALSE,0,COUNTIF(A$3:A210,\">0\")+1)","v":0},"EMD 75SK","Elektronikus kond. leer. szerviz kit","23 830,-Ft ","OMEGA",null,86.417000000000002,null,23830]
[{"$f":"IF(L212=FALSE,0,COUNTIF(A$3:A211,\">0\")+1)","v":0},"EMD 12 Vac","Elektronikus kondenzátum leeresztő 24 Vac","40 550,-Ft ","OMEGA",null,151.61599999999999,null,40550]
[{"$f":"IF(L213=FALSE,0,COUNTIF(A$3:A212,\">0\")+1)","v":0},"EMD 12A Vac","Elektronikus kondenzátum leeresztő 24 Vac","46 750,-Ft ","OMEGA",null,174.791,null,46750]
[{"$f":"IF(L214=FALSE,0,COUNTIF(A$3:A213,\">0\")+1)","v":0},"EMD 12A Vdc","Elektronikus kondenzátum leeresztő 24 Vcd","43 830,-Ft ","OMEGA",null,163.87299999999999,null,43830]
[{"$f":"IF(L215=FALSE,0,COUNTIF(A$3:A214,\">0\")+1)","v":0},"ECD 15B","Elektronikus kondenzátum leeresztő 115/230V","46 160,-Ft ","OMEGA",null,172.56620000000001,null,46160]
[{"$f":"IF(L216=FALSE,0,COUNTIF(A$3:A215,\">0\")+1)","v":0},"ECD 40B","Elektronikus kondenzátum leeresztő 115/230V","47 100,-Ft ","OMEGA",null,176.08880000000002,null,47100]
[{"$f":"IF(L217=FALSE,0,COUNTIF(A$3:A216,\">0\")+1)","v":0},"ECD 90B","Elektronikus kondenzátum leeresztő 115/230V","47 720,-Ft ","OMEGA",null,178.41660000000002,null,47720]
[{"$f":"IF(L218=FALSE,0,COUNTIF(A$3:A217,\">0\")+1)","v":0},"ECD 150B","Elektronikus kondenzátum leeresztő 115/230V","58 200,-Ft ","OMEGA",null,217.5772,null,58200]
[{"$f":"IF(L219=FALSE,0,COUNTIF(A$3:A218,\">0\")+1)","v":0},"CKL 005 B","Alumínium ciklonszűrő ház  3/8","13 930,-Ft ","OMEGA",null,50.531800000000004,null,13930]
[{"$f":"IF(L220=FALSE,0,COUNTIF(A$3:A219,\">0\")+1)","v":0},"CKL 007 B","Alumínium ciklonszűrő ház  1/2","15 670,-Ft ","OMEGA",null,56.825100000000006,null,15670]
[{"$f":"IF(L221=FALSE,0,COUNTIF(A$3:A220,\">0\")+1)","v":0},"CKL 010 B","Alumínium ciklonszűrő ház  3/4","18 470,-Ft ","OMEGA",null,66.970600000000005,null,18470]
[{"$f":"IF(L222=FALSE,0,COUNTIF(A$3:A221,\">0\")+1)","v":0},"CKL 018 B","Alumínium ciklonszűrő ház  1","26 470,-Ft ","OMEGA",null,95.985699999999994,null,26470]
[{"$f":"IF(L223=FALSE,0,COUNTIF(A$3:A222,\">0\")+1)","v":0},"CKL 047 B","Alumínium ciklonszűrő ház  1 1/2","33 110,-Ft ","OMEGA",null,123.7957,null,33110]
[{"$f":"IF(L224=FALSE,0,COUNTIF(A$3:A223,\">0\")+1)","v":0},"CKL 094 B","Alumínium ciklonszűrő ház  2","67 910,-Ft ","OMEGA",null,253.87440000000001,null,67910]
[{"$f":"IF(L225=FALSE,0,COUNTIF(A$3:A224,\">0\")+1)","v":0},"CKL 150 B","Alumínium ciklonszűrő ház  2 1/2","82 420,-Ft ","OMEGA",null,308.15540000000004,null,82420]
[{"$f":"IF(L226=FALSE,0,COUNTIF(A$3:A225,\">0\")+1)","v":0},"CKL 200 B","Alumínium ciklonszűrő ház  3","163 040,-Ft ","OMEGA",null,629.01070000000004,null,163040]
[{"$f":"IF(L227=FALSE,0,COUNTIF(A$3:A226,\">0\")+1)","v":0},"6050CKL-B","Szűrőbetét CKL 6050CKL-B 3/8","5 720,-Ft ","OMEGA",null,20.744200000000003,null,5720]
[{"$f":"IF(L228=FALSE,0,COUNTIF(A$3:A227,\">0\")+1)","v":0},"7050CKL-B","Szűrőbetét CKL 7050CKL-B 1/2","5 720,-Ft ","OMEGA",null,20.744200000000003,null,5720]
[{"$f":"IF(L229=FALSE,0,COUNTIF(A$3:A228,\">0\")+1)","v":0},"14050CKL-B","Szűrőbetét CKL 14050CKL-B 3/4","7 060,-Ft ","OMEGA",null,25.616100000000003,null,7060]
[{"$f":"IF(L230=FALSE,0,COUNTIF(A$3:A229,\">0\")+1)","v":0},"12075CKL-B","Szűrőbetét CKL 12075CKL-B 1","8 610,-Ft ","OMEGA",null,31.2193,null,8610]
[{"$f":"IF(L231=FALSE,0,COUNTIF(A$3:A230,\">0\")+1)","v":0},"32075CKL-B","Szűrőbetét CKL 32075CKL-B 1 1/2","10 070,-Ft ","OMEGA",null,36.513500000000001,null,10070]
[{"$f":"IF(L232=FALSE,0,COUNTIF(A$3:A231,\">0\")+1)","v":0},"51090CKL-B","Szűrőbetét CKL 51090CKL-B 2","21 170,-Ft ","OMEGA",null,76.786500000000004,null,21170]
[{"$f":"IF(L233=FALSE,0,COUNTIF(A$3:A232,\">0\")+1)","v":0},"76090CKL-B","Szűrőbetét CKL 76090CKL-B 2 1/2",{"$f":"IF(H233=\"SP\",IF(J233>0,\"SP: \"&TEXT(J233*I$1,\"# ###,-Ft  \"),\"SP: \"&TEXT(I233*I$1,\"# ###,-Ft\")),IF(J233>0,\"*(\"&TEXT(I233*I$1,\"# ###,-\")&\") \n\"&TEXT(J233*J$1,\"# ###,-Ft\"),TEXT(I233*I$1,\"# ###,-Ft  \")))","v":"21 170,-Ft "},"OMEGA",null,76.786500000000004,null,21170]
[{"$f":"IF(L234=FALSE,0,COUNTIF(A$3:A233,\">0\")+1)","v":0},"51140CKL-B","Szűrőbetét CKL 51140CKL-B 3","43 880,-Ft ","OMEGA",null,164.06870000000001,null,43880]
[{"$f":"IF(L235=FALSE,0,COUNTIF(A$3:A234,\">0\")+1)","v":0},"WOSm 1","Olaj-víz szétválasztó","38 220,-Ft ","OMEGA",null,142.88159999999999,null,38220]
[{"$f":"IF(L236=FALSE,0,COUNTIF(A$3:A235,\">0\")+1)","v":0},"WOSm 2","Olaj-víz szétválasztó","45 980,-Ft ","OMEGA",null,171.89669999999998,null,45980]
[{"$f":"IF(L237=FALSE,0,COUNTIF(A$3:A236,\">0\")+1)","v":0},"WOS-m1","Olaj-víz szétválasztó betét","21 050,-Ft ","OMEGA",null,76.353899999999996,null,21050]
[{"$f":"IF(L238=FALSE,0,COUNTIF(A$3:A237,\">0\")+1)","v":0},"WOS-m2","Olaj-víz szétválasztó betét","28 180,-Ft ","OMEGA",null,105.369,null,28180]
[{"$f":"IF(L239=FALSE,0,COUNTIF(A$3:A238,\">0\")+1)","v":0},"WQTK","Teszter","12 170,-Ft ","OMEGA",null,44.1355,null,12170]
[{"$f":"IF(L240=FALSE,0,COUNTIF(A$3:A239,\">0\")+1)","v":0},"WOS 4","Olaj-víz szétválasztó","88 530,-Ft ","OMEGA",null,331.00080000000003,null,88530]
[{"$f":"IF(L241=FALSE,0,COUNTIF(A$3:A240,\">0\")+1)","v":0},"WOS 8","Olaj-víz szétválasztó","135 840,-Ft ","OMEGA",null,524.08460000000002,null,135840]
[{"$f":"IF(L242=FALSE,0,COUNTIF(A$3:A241,\">0\")+1)","v":0},"WOS 20","Olaj-víz szétválasztó","191 610,-Ft ","OMEGA",null,739.23100000000011,null,191610]
[{"$f":"IF(L243=FALSE,0,COUNTIF(A$3:A242,\">0\")+1)","v":0},"WOS 35","Olaj-víz szétválasztó","260 250,-Ft ","OMEGA",null,1037.1378999999999,null,260250]
[{"$f":"IF(L244=FALSE,0,COUNTIF(A$3:A243,\">0\")+1)","v":0},"WOS 4PP","Olaj-víz szétválasztó betét PP","15 210,-Ft ","OMEGA",null,55.166800000000002,null,15210]
[{"$f":"IF(L245=FALSE,0,COUNTIF(A$3:A244,\">0\")+1)","v":0},"WOS 8PP","Olaj-víz szétválasztó betét PP","21 300,-Ft ","OMEGA",null,77.229400000000012,null,21300]
[{"$f":"IF(L246=FALSE,0,COUNTIF(A$3:A245,\">0\")+1)","v":0},"WOS 20PP","Olaj-víz szétválasztó betét PP","30 990,-Ft ","OMEGA",null,115.85440000000001,null,30990]
[{"$f":"IF(L247=FALSE,0,COUNTIF(A$3:A246,\">0\")+1)","v":0},"WOS 35PP","Olaj-víz szétválasztó betét PP","50 170,-Ft ","OMEGA",null,187.56299999999999,null,50170]
[{"$f":"IF(L248=FALSE,0,COUNTIF(A$3:A247,\">0\")+1)","v":0},"WOS 4AK","Olaj-víz szétválasztó betét AK","15 210,-Ft ","OMEGA",null,55.166800000000002,null,15210]
[{"$f":"IF(L249=FALSE,0,COUNTIF(A$3:A248,\">0\")+1)","v":0},"WOS 8AK","Olaj-víz szétválasztó betét AK","21 300,-Ft ","OMEGA",null,77.229400000000012,null,21300]
[{"$f":"IF(L250=FALSE,0,COUNTIF(A$3:A249,\">0\")+1)","v":0},"WOS 20AK","Olaj-víz szétválasztó betét AK","30 990,-Ft ","OMEGA",null,115.85440000000001,null,30990]
[{"$f":"IF(L251=FALSE,0,COUNTIF(A$3:A250,\">0\")+1)","v":0},"WOS 35AK","Olaj-víz szétválasztó betét AK","50 170,-Ft ","OMEGA",null,187.56299999999999,null,50170]
[{"$f":"IF(L252=FALSE,0,COUNTIF(A$3:A251,\">0\")+1)","v":0},"ECD 15B, 40B \nservice kit 1","Szerviz KIT","4 210,-Ft ","OMEGA",null,15.274900000000001,null,4210]
[{"$f":"IF(L253=FALSE,0,COUNTIF(A$3:A252,\">0\")+1)","v":0},"ECD 90B \nservice kit 1","Szerviz KIT","4 620,-Ft ","OMEGA",null,16.758099999999999,null,4620]
[{"$f":"IF(L254=FALSE,0,COUNTIF(A$3:A253,\">0\")+1)","v":0},"ECD 150B \nservice kit 1","Szerviz KIT","5 230,-Ft ","OMEGA",null,18.951999999999998,null,5230]
[{"$f":"IF(L255=FALSE,0,COUNTIF(A$3:A254,\">0\")+1)","v":0},"ECD 15B, 40B \nservice kit 2","Szerviz KIT","19 540,-Ft ","OMEGA",null,70.864000000000004,null,19540]
[{"$f":"IF(L256=FALSE,0,COUNTIF(A$3:A255,\">0\")+1)","v":0},"ECD 90B \nservice kit 2","Szerviz KIT","20 170,-Ft ","OMEGA",null,73.13,null,20170]
[{"$f":"IF(L257=FALSE,0,COUNTIF(A$3:A256,\">0\")+1)","v":0},"ECD 150B \nservice kit 2","Szerviz KIT","21 270,-Ft ","OMEGA",null,77.147000000000006,null,21270]
[{"$f":"IF(L258=FALSE,0,COUNTIF(A$3:A257,\">0\")+1)","v":0},"TD 50M",null,"38 310,-Ft ","OMEGA",null,143.21119999999999,null,38310]
[{"$f":"IF(L259=FALSE,0,COUNTIF(A$3:A258,\">0\")+1)","v":0},"EMD HP","Elektronikus kondenzátum leeresztő 115/230V","229 340,-Ft ","OMEGA",null,884.77,null,229340]
[{"$f":"IF(L260=FALSE,0,COUNTIF(A$3:A259,\">0\")+1)","v":0},"EMD HP A","Elektronikus kondenzátum leeresztő 115/230V","233 140,-Ft ","OMEGA",null,899.44749999999999,null,233140]
[{"$f":"IF(L261=FALSE,0,COUNTIF(A$3:A260,\">0\")+1)","v":0},"EMD HP C",null,"238 360,-Ft ","OMEGA",null,919.58399999999995,null,238360]
[{"$f":"IF(L262=FALSE,0,COUNTIF(A$3:A261,\">0\")+1)","v":0},"EMD HP","Elektronikus kondenzátum leeresztő 115/230V","229 340,-Ft ","OMEGA",null,933.798,null,229340]
[{"$f":"IF(L263=FALSE,0,COUNTIF(A$3:A262,\">0\")+1)","v":0},"EMD HP A","Elektronikus kondenzátum leeresztő 115/230V Vac","233 140,-Ft ","OMEGA",null,973.14400000000001,null,233140]
[{"$f":"IF(L264=FALSE,0,COUNTIF(A$3:A263,\">0\")+1)","v":0},"EMD HP A","Elektronikus kondenzátum leeresztő 115/230V Acd","233 140,-Ft ","OMEGA",null,958.20899999999995,null,233140]
[{"$f":"IF(L265=FALSE,0,COUNTIF(A$3:A264,\">0\")+1)","v":0},"EMD HP SK","Szerviz KIT","32 590,-Ft ","OMEGA",null,121.849,null,32590]
[{"$f":"IF(L266=FALSE,0,COUNTIF(A$3:A265,\">0\")+1)","v":0},"AOK 50B","Nagy nyomású automata leeresztő","105 460,-Ft ","OMEGA",null,406.85,null,105460]
[{"$f":"IF(L267=FALSE,0,COUNTIF(A$3:A266,\">0\")+1)","v":0},"AOK 50SS","Nagy nyomású automata leeresztő saválló","158 190,-Ft ","OMEGA",null,610.27499999999998,null,158190]
[{"$f":"IF(L268=FALSE,0,COUNTIF(A$3:A267,\">0\")+1)","v":0},"AOK 20SS","Automata leeresztő saválló","137 490,-Ft ","OMEGA",null,530.45000000000005,null,137490]
[{"$f":"IF(L269=FALSE,0,COUNTIF(A$3:A268,\">0\")+1)","v":0},"AOK 16B","Belő uszós autómata leürítő","7 060,-Ft ","OMEGA",null,25.595500000000001,null,7060]
[{"$f":"IF(L270=FALSE,0,COUNTIF(A$3:A269,\">0\")+1)","v":0},"AOK 16F","Belő uszós autómata leürítő 16F","10 390,-Ft ","OMEGA",null,37.667099999999998,null,10390]
[{"$f":"IF(L271=FALSE,0,COUNTIF(A$3:A270,\">0\")+1)","v":0},"IED","Kompakt elektronikus lürítő","24 110,-Ft ","OMEGA",null,87.447000000000003,null,24110]
[{"$f":"IF(L272=FALSE,0,COUNTIF(A$3:A271,\">0\")+1)","v":0},"PDI 16","Nyomáskülönbség jelző indikátor","4 540,-Ft ","OMEGA",null,16.449100000000001,null,4540]
[{"$f":"IF(L273=FALSE,0,COUNTIF(A$3:A272,\">0\")+1)","v":0},"MDM 60","Nyomáskülönbség jelző 16bar","10 470,-Ft ","OMEGA",null,37.955500000000001,null,10470]
[{"$f":"IF(L274=FALSE,0,COUNTIF(A$3:A273,\">0\")+1)","v":0},"MDM 60C","Nyomáskülönbség jelző 16bar Jeladós","14 630,-Ft ","OMEGA",null,53.065600000000003,null,14630]
[{"$f":"IF(L275=FALSE,0,COUNTIF(A$3:A274,\">0\")+1)","v":0},"MDM 60E","Nyomáskülönbség jelző 16bar LED","18 470,-Ft ","OMEGA",null,66.970600000000005,null,18470]
[{"$f":"IF(L276=FALSE,0,COUNTIF(A$3:A275,\">0\")+1)","v":0},"MDA60","Nyomáskülönbség jelző 60bar","14 270,-Ft ","OMEGA",null,51.747200000000007,null,14270]
[{"$f":"IF(L277=FALSE,0,COUNTIF(A$3:A276,\">0\")+1)","v":0},"MDM 40","Nyomáskülönbség jelző 20bar","10 060,-Ft ","OMEGA",null,36.492899999999999,null,10060]
[{"$f":"IF(L278=FALSE,0,COUNTIF(A$3:A277,\">0\")+1)","v":0},"MDM 40C","Nyomáskülönbség jelző 20bar Jeladós","14 050,-Ft ","OMEGA",null,50.964399999999998,null,14050]
[{"$f":"IF(L279=FALSE,0,COUNTIF(A$3:A278,\">0\")+1)","v":0},"EPG 60","Nyomás és nykülönbség jelző 16bar digit","38 200,-Ft ","OMEGA",null,142.79919999999998,null,38200]
[{"$f":"IF(L280=FALSE,0,COUNTIF(A$3:A279,\">0\")+1)","v":0},"EPG 60SN","Nyomás és nykülönbség jelző 16bar digit","52 330,-Ft ","OMEGA",null,195.62790000000001,null,52330]
[{"$f":"IF(L281=FALSE,0,COUNTIF(A$3:A280,\">0\")+1)","v":0},"MDA 60","Nyomáskülönbség jelző 20bar","14 270,-Ft ","OMEGA",null,51.747200000000007,null,14270]
[{"$f":"IF(L282=FALSE,0,COUNTIF(A$3:A281,\">0\")+1)","v":0},"MDH 50","Nyomáskülönbség jelző 50bar","141 560,-Ft ","OMEGA",null,546.1472,null,141560]
[{"$f":"IF(L283=FALSE,0,COUNTIF(A$3:A282,\">0\")+1)","v":0},"SG","Szintjelző","4 500,-Ft ","OMEGA",null,16.325500000000002,null,4500]
[{"$f":"IF(L284=FALSE,0,COUNTIF(A$3:A283,\">0\")+1)","v":0},"WS","Fali tartó","11 130,-Ft ","OMEGA",null,40.376000000000005,null,11130]
[{"$f":"IF(L285=FALSE,0,COUNTIF(A$3:A284,\">0\")+1)","v":0},"WM","Fali tartó","13 930,-Ft ","OMEGA",null,50.531800000000004,null,13930]
[{"$f":"IF(L286=FALSE,0,COUNTIF(A$3:A285,\">0\")+1)","v":0},"2S","Soroló elem 2 szűrőhöz kicsi","2 950,-Ft ","OMEGA",null,10.701700000000001,null,2950]
[{"$f":"IF(L287=FALSE,0,COUNTIF(A$3:A286,\">0\")+1)","v":0},"3S","Soroló elem 3 szűrőhöz kicsi","3 830,-Ft ","OMEGA",null,13.8947,null,3830]
[{"$f":"IF(L288=FALSE,0,COUNTIF(A$3:A287,\">0\")+1)","v":0},"2M","Soroló elem 2 szűrőhöz közepes","4 540,-Ft ","OMEGA",null,16.449100000000001,null,4540]
[{"$f":"IF(L289=FALSE,0,COUNTIF(A$3:A288,\">0\")+1)","v":0},"3M","Soroló elem 3 szűrőhöz közepes","5 600,-Ft ","OMEGA",null,20.301300000000001,null,5600]
[{"$f":"IF(L290=FALSE,0,COUNTIF(A$3:A289,\">0\")+1)","v":0},"AK-3/4","Tartó KIT 3/4\"-ig","22 150,-Ft ","OMEGA",null,80.319400000000002,null,22150]
[{"$f":"IF(L291=FALSE,0,COUNTIF(A$3:A290,\">0\")+1)","v":0},"AK-1 1/2","Tartó KIT 1 1/2\"-g","25 740,-Ft ","OMEGA",null,93.338600000000014,null,25740]
[{"$f":"IF(L292=FALSE,0,COUNTIF(A$3:A291,\">0\")+1)","v":0},"AK-3","Tartó KIT 3\"-ig","64 740,-Ft ","OMEGA",null,242.05,null,64740]
[{"$f":"IF(L293=FALSE,0,COUNTIF(A$3:A292,\">0\")+1)","v":0},"AK 3/8\"","Tartó KIT","22 150,-Ft ","OMEGA",null,80.319400000000002,null,22150]
[{"$f":"IF(L294=FALSE,0,COUNTIF(A$3:A293,\">0\")+1)","v":0},"AK 1/2\"","Tartó KIT","22 150,-Ft ","OMEGA",null,80.319400000000002,null,22150]
[{"$f":"IF(L295=FALSE,0,COUNTIF(A$3:A294,\">0\")+1)","v":0},"AK 3/4\"","Tartó KIT","22 150,-Ft ","OMEGA",null,80.319400000000002,null,22150]
[{"$f":"IF(L296=FALSE,0,COUNTIF(A$3:A295,\">0\")+1)","v":0},"AK 1\"","Tartó KIT","25 740,-Ft ","OMEGA",null,93.338600000000014,null,25740]
[{"$f":"IF(L297=FALSE,0,COUNTIF(A$3:A296,\">0\")+1)","v":0},"AK 1 1/2\"","Tartó KIT",{"$f":"IF(H297=\"SP\",IF(J297>0,\"SP: \"&TEXT(J297*I$1,\"# ###,-Ft  \"),\"SP: \"&TEXT(I297*I$1,\"# ###,-Ft\")),IF(J297>0,\"*(\"&TEXT(I297*I$1,\"# ###,-\")&\") \n\"&TEXT(J297*J$1,\"# ###,-Ft\"),TEXT(I297*I$1,\"# ###,-Ft  \")))","v":"25 740,-Ft "},"OMEGA",null,93.338600000000014,null,25740]
[{"$f":"IF(L298=FALSE,0,COUNTIF(A$3:A297,\">0\")+1)","v":0},"AK 2\"","Tartó KIT","64 740,-Ft ","OMEGA",null,242.05,null,64740]
[{"$f":"IF(L299=FALSE,0,COUNTIF(A$3:A298,\">0\")+1)","v":0},"AK 2 1/2\"","Tartó KIT","64 740,-Ft ","OMEGA",null,242.05,null,64740]
[{"$f":"IF(L300=FALSE,0,COUNTIF(A$3:A299,\">0\")+1)","v":0},"AK 3\"","Tartó KIT","64 740,-Ft ","OMEGA",null,242.05,null,64740]
[{"$f":"IF(L301=FALSE,0,COUNTIF(A$3:A300,\">0\")+1)","v":0},"AK-3/8”, AK-½”, AK-3/4” ","Tartó KIT","22 150,-Ft ","OMEGA",null,80.319400000000002,null,22150]
[{"$f":"IF(L302=FALSE,0,COUNTIF(A$3:A301,\">0\")+1)","v":0},"AK-1”, AK-1½”","Tartó KIT","25 740,-Ft ","OMEGA",null,93.338600000000014,null,25740]
[{"$f":"IF(L303=FALSE,0,COUNTIF(A$3:A302,\">0\")+1)","v":0},"AK-2”, AK-2½”, AK-3” ","Tartó KIT","64 740,-Ft ","OMEGA",null,242.05,null,64740]
[{"$f":"IF(L304=FALSE,0,COUNTIF(A$3:A303,\">0\")+1)","v":0},"SG - Sight glass","Szintjelző űveg","4 500,-Ft ","OMEGA",null,16.325500000000002,null,4500]
[{"$f":"IF(L305=FALSE,0,COUNTIF(A$3:A304,\">0\")+1)","v":0},"NIPPLE","Közcsavar","4 810,-Ft ","OMEGA",null,17.427600000000002,null,4810]
[{"$f":"IF(L306=FALSE,0,COUNTIF(A$3:A305,\">0\")+1)","v":0},"NIPPLE 20SS","Közcsavar","19 740,-Ft ","OMEGA",null,71.585000000000008,null,19740]
[{"$f":"IF(L307=FALSE,0,COUNTIF(A$3:A306,\">0\")+1)","v":0},"NIPPLE 50SS","Közcsavar","21 840,-Ft ","OMEGA",null,79.207000000000008,null,21840]
[{"$f":"IF(L308=FALSE,0,COUNTIF(A$3:A307,\">0\")+1)","v":0},"NIPPLE HP","Közcsavar","5 300,-Ft ","OMEGA",null,19.209499999999998,null,5300]
[{"$f":"IF(L309=FALSE,0,COUNTIF(A$3:A308,\">0\")+1)","v":0},"ball valve","Golyóscsap","3 070,-Ft ","OMEGA",null,11.144600000000001,null,3070]
[{"$f":"IF(L310=FALSE,0,COUNTIF(A$3:A309,\">0\")+1)","v":0},"Drain valve","Kondenzátum leeresztő csap 1/2\"","34 440,-Ft ","OMEGA",null,128.75,null,34440]
[{"$f":"IF(L311=FALSE,0,COUNTIF(A$3:A310,\">0\")+1)","v":0},"Drain valve 1\"","Kondenzátum leeresztő csap 1\"","35 540,-Ft ","OMEGA",null,132.87,null,35540]
[{"$f":"IF(L312=FALSE,0,COUNTIF(A$3:A311,\">0\")+1)","v":0},"Drain valve 1/4\"","Kondenzátum leeresztő csap 1/4\"","21 300,-Ft ","OMEGA",null,77.25,null,21300]
[{"$f":"IF(L313=FALSE,0,COUNTIF(A$3:A312,\">0\")+1)","v":0},"Drain valve 1/8\"","Kondenzátum leeresztő csap 1/8\"","17 610,-Ft ","OMEGA",null,63.86,null,17610]
[{"$f":"IF(L314=FALSE,0,COUNTIF(A$3:A313,\">0\")+1)","v":0},"Drain valve 400","Kondenzátum leeresztő csap 1/2\" 400bar","59 230,-Ft ","OMEGA",null,221.45000000000002,null,59230]
[{"$f":"IF(L315=FALSE,0,COUNTIF(A$3:A314,\">0\")+1)","v":0},"MCDi","Kondenzátum leeresztő INOX","6 930,-Ft ","OMEGA",null,25.131999999999998,null,6930]
[{"$f":"IF(L316=FALSE,0,COUNTIF(A$3:A315,\">0\")+1)","v":0},"WSm","Tartó elem","9 710,-Ft ","OMEGA",null,35.226000000000006,null,9710]
[{"$f":"IF(L317=FALSE,0,COUNTIF(A$3:A316,\">0\")+1)","v":0},"WMm","Tartó elem","10 560,-Ft ","OMEGA",null,38.295400000000001,null,10560]
[{"$f":"IF(L318=FALSE,0,COUNTIF(A$3:A317,\">0\")+1)","v":0},"WLm","Tartó elem","11 560,-Ft ","OMEGA",null,41.910699999999999,null,11560]
[{"$f":"IF(L319=FALSE,0,COUNTIF(A$3:A318,\">0\")+1)","v":0},"AKSm 2","Közösítő","2 990,-Ft ","OMEGA",null,10.8253,null,2990]
[{"$f":"IF(L320=FALSE,0,COUNTIF(A$3:A319,\">0\")+1)","v":0},"AKMm 2","Közösítő",{"$f":"IF(H340=\"SP\",IF(J340>0,\"SP: \"&TEXT(J340*I$1,\"# ###,-Ft  \"),\"SP: \"&TEXT(I340*I$1,\"# ###,-Ft\")),IF(J340>0,\"*(\"&TEXT(I340*I$1,\"# ###,-\")&\") \n\"&TEXT(J340*J$1,\"# ###,-Ft\"),TEXT(I340*I$1,\"# ###,-Ft  \")))","v":"1 810,-Ft "},"OMEGA",null,12.0922,null,3330]
[{"$f":"IF(L321=FALSE,0,COUNTIF(A$3:A320,\">0\")+1)","v":0},"AKLm 2","Közösítő","3 570,-Ft ","OMEGA",null,12.947100000000001,null,3570]
[{"$f":"IF(L322=FALSE,0,COUNTIF(A$3:A321,\">0\")+1)","v":0},"AKSm 3","Közösítő","4 010,-Ft ","OMEGA",null,14.533300000000001,null,4010]
[{"$f":"IF(L323=FALSE,0,COUNTIF(A$3:A322,\">0\")+1)","v":0},"AKMm 3","Közösítő","4 450,-Ft ","OMEGA",null,16.129799999999999,null,4450]
[{"$f":"IF(L324=FALSE,0,COUNTIF(A$3:A323,\">0\")+1)","v":0},"AKLm 3","Közösítő","4 770,-Ft ","OMEGA",null,17.293700000000001,null,4770]
[{"$f":"IF(L325=FALSE,0,COUNTIF(A$3:A324,\">0\")+1)","v":0},8973005570,"Nyomáskapcsoló ABAC 230V 1X1/4 China",{"$f":"IF(H325=\"SP\",IF(J325>0,\"SP: \"&TEXT(J325*I$1,\"# ###,-Ft  \"),\"SP: \"&TEXT(I325*I$1,\"# ###,-Ft\")),IF(J325>0,\"*(\"&TEXT(I325*I$1,\"# ###,-\")&\") \n\"&TEXT(J325*J$1,\"# ###,-Ft\"),TEXT(I325*I$1,\"# ###,-Ft  \")))","v":"2 360,-Ft "},"Nyomáskapcsoló",null,null,null,2360]
[{"$f":"IF(L326=FALSE,0,COUNTIF(A$3:A325,\">0\")+1)","v":0},8973005916,"3/8\" szűrő szabályozó 2db gyorskuplunggal","6 750,-Ft ","ABAC Termék",null,null,null,6750]
[{"$f":"IF(L327=FALSE,0,COUNTIF(A$3:A326,\">0\")+1)","v":0},8973005861,"1/4\" micro szűrő szabályozó 1db gyorskuplunggal","3 760,-Ft ","ABAC Termék",null,null,null,3760]
[{"$f":"IF(L328=FALSE,0,COUNTIF(A$3:A327,\">0\")+1)","v":0},"KO-FR830014","Nyomásszabályzó manométerrel 1/4\"","3 220,-Ft ","KONF",null,null,null,3220]
[{"$f":"IF(L329=FALSE,0,COUNTIF(A$3:A328,\">0\")+1)","v":0},"KO-FR860038","Szűrőszabályzó manométerrel 3/8\"","6 190,-Ft ","KONF",null,null,null,6190]
[{"$f":"IF(L330=FALSE,0,COUNTIF(A$3:A329,\">0\")+1)","v":0},"KO-PT010002","NE-MA nyomáskapcsoló 230V 3X1/4\" Italy","4 950,-Ft ","KONF",null,null,null,4950]
[{"$f":"IF(L331=FALSE,0,COUNTIF(A$3:A330,\">0\")+1)","v":0},"KO-PT020002","NE-MA Háromfázisú nyomáskapcsoló 400V","7 430,-Ft ","KONF",null,null,null,7430]
[{"$f":"IF(L332=FALSE,0,COUNTIF(A$3:A331,\">0\")+1)","v":0},"KO-RV110012","Állítható biztonsági szelep 1/2\"","4 130,-Ft ","KONF",null,null,null,4130]
[{"$f":"IF(L333=FALSE,0,COUNTIF(A$3:A332,\">0\")+1)","v":0},"KO-RV110014","Állítható biztonsági szelep 1/4\"","2 060,-Ft ","KONF",null,null,null,2060]
[{"$f":"IF(L334=FALSE,0,COUNTIF(A$3:A333,\">0\")+1)","v":0},"KO-RV110038","Állítható biztonsági szelep 3/8\"","2 470,-Ft ","KONF",null,null,null,2470]
[{"$f":"IF(L335=FALSE,0,COUNTIF(A$3:A334,\">0\")+1)","v":0},"KO-RV141212","Visszacsapó szelep KK 1/2\"","2 190,-Ft ","KONF",null,null,null,2190]
[{"$f":"IF(L336=FALSE,0,COUNTIF(A$3:A335,\">0\")+1)","v":0},"KO-RV141238","Visszacsapó szelep KK 3/8\"-1/2\"","1 570,-Ft ","KONF",null,null,null,1570]
[{"$f":"IF(L337=FALSE,0,COUNTIF(A$3:A336,\">0\")+1)","v":0},"KO-RV143412","Visszacsapó szelep KK 1/2\"-3/4\"","2 410,-Ft ","KONF",null,null,null,2410]
[{"$f":"IF(L338=FALSE,0,COUNTIF(A$3:A337,\">0\")+1)","v":0},"KO-RV143838","Visszacsapó szelep KK 3/8\"","1 470,-Ft ","KONF",null,null,null,1470]
[{"$f":"IF(L339=FALSE,0,COUNTIF(A$3:A338,\">0\")+1)","v":0},"KO-RV161212","Visszacsapó szelep BK 1/2-1/2","2 310,-Ft ","KONF",null,null,null,2310]
[{"$f":"IF(L340=FALSE,0,COUNTIF(A$3:A339,\">0\")+1)","v":0},"KO-RV161238","Visszacsapó szelep BK 1/2-3/8","1 810,-Ft ","KONF",null,null,null,1810]
[{"$f":"IF(L341=FALSE,0,COUNTIF(A$3:A340,\">0\")+1)","v":0},"KO-RV163412","Visszacsapó szelep BK 3/4-1/2","3 220,-Ft ","KONF",null,null,null,3220]
[{"$f":"IF(L342=FALSE,0,COUNTIF(A$3:A341,\">0\")+1)","v":0},"KO-RV163434","Visszacsapó szelep BK 3/4-3/4","3 220,-Ft ","KONF",null,null,null,3220]
[{"$f":"IF(L343=FALSE,0,COUNTIF(A$3:A342,\">0\")+1)","v":0},"KO-RV200101","Visszacsapó szelep BB 1-1","5 110,-Ft ","KONF",null,null,null,5110]
[{"$f":"IF(L344=FALSE,0,COUNTIF(A$3:A343,\">0\")+1)","v":0},"KO-MN604018012P","Manométert hátsó D40 1/8\" 0-12","1 181,-Ft ","KONF",null,null,null,1181.1023622047244]
[{"$f":"IF(L345=FALSE,0,COUNTIF(A$3:A344,\">0\")+1)","v":0},"KO-MN604018016P","Manométert hátsó D40 1/8\" 0-16","1 181,-Ft ","KONF",null,null,null,1181.1023622047244]
[{"$f":"IF(L346=FALSE,0,COUNTIF(A$3:A345,\">0\")+1)","v":0},"KO-MN605014012P","Manométert hátsó D50 1/4\" 0-12","1 409,-Ft ","KONF",null,null,null,1409.4488188976377]
[{"$f":"IF(L347=FALSE,0,COUNTIF(A$3:A346,\">0\")+1)","v":0},"KO-MN605014016P","Manométert hátsó D50 1/4\" 0-16","1 409,-Ft ","KONF",null,null,null,1409.4488188976377]
[{"$f":"IF(L348=FALSE,0,COUNTIF(A$3:A347,\">0\")+1)","v":0},"KO-MN606314012P","Manométert hátsó D63 1/4\" 0-12","1 567,-Ft ","KONF",null,null,null,1566.9291338582677]
[{"$f":"IF(L349=FALSE,0,COUNTIF(A$3:A348,\">0\")+1)","v":0},"KO-MN606314016P","Manométert hátsó D63 1/4\" 0-16","1 567,-Ft ","KONF",null,null,null,1566.9291338582677]
[{"$f":"IF(L350=FALSE,0,COUNTIF(A$3:A349,\">0\")+1)","v":0},"KO-MN625014016PF","Keretes manométer, 50-es, 1/4\", 16 bar","3 870,-Ft ","KONF",null,null,null,3870]
[{"$f":"IF(L351=FALSE,0,COUNTIF(A$3:A350,\">0\")+1)","v":0},"KO-MN626314016PF","Keretes manométer, 63-as, 1/4\", 16 bar","4 120,-Ft ","KONF",null,null,null,4120]
[{"$f":"IF(L352=FALSE,0,COUNTIF(A$3:A351,\">0\")+1)","v":0},"KO-MN654018012R","Manométert alsó D40 1/8\" 0-12","1 260,-Ft ","KONF",null,null,null,1259.8425196850394]
[{"$f":"IF(L353=FALSE,0,COUNTIF(A$3:A352,\">0\")+1)","v":0},"KO-MN654018016R","Manométert alsó D40 1/8\" 0-16","1 260,-Ft ","KONF",null,null,null,1259.8425196850394]
[{"$f":"IF(L354=FALSE,0,COUNTIF(A$3:A353,\">0\")+1)","v":0},"KO-MN655014012R","Manométert alsó D50 1/4\" 0-12","1 409,-Ft ","KONF",null,null,null,1409.4488188976377]
[{"$f":"IF(L355=FALSE,0,COUNTIF(A$3:A354,\">0\")+1)","v":0},"KO-MN655014016R","Manométert alsó D50 1/4\" 0-16","1 409,-Ft ","KONF",null,null,null,1409.4488188976377]
[{"$f":"IF(L356=FALSE,0,COUNTIF(A$3:A355,\">0\")+1)","v":0},"KO-MN656314012R","Manométert alsó D63 1/4\" 0-12","1 567,-Ft ","KONF",null,null,null,1566.9291338582677]
[{"$f":"IF(L357=FALSE,0,COUNTIF(A$3:A356,\">0\")+1)","v":0},"KO-MN656314016R","Manométert alsó D63 1/4\" 0-16","1 567,-Ft ","KONF",null,null,null,1566.9291338582677]
[{"$f":"IF(L358=FALSE,0,COUNTIF(A$3:A357,\">0\")+1)","v":0},"KO-Q15VITON","Gumitönk 15","380,-Ft ","KONF",null,null,null,380]
[{"$f":"IF(L359=FALSE,0,COUNTIF(A$3:A358,\">0\")+1)","v":0},"KO-Q20VITON","Gumitönk 20","622,-Ft ","KONF",null,null,null,621.79999999999995]
[{"$f":"IF(L360=FALSE,0,COUNTIF(A$3:A359,\">0\")+1)","v":0},"KO-Q25VITON","Gumitönk 25","640,-Ft ","KONF",null,null,null,640]
[{"$f":"IF(L361=FALSE,0,COUNTIF(A$3:A360,\">0\")+1)","v":0},"KO-Q30VITON","Gumitönk 30","1 340,-Ft ","KONF",null,null,null,1340]
[{"$f":"IF(L362=FALSE,0,COUNTIF(A$3:A361,\">0\")+1)","v":0},"KO-RV280012","Leürítő 1/2\"","470,-Ft ","KONF",null,null,null,470]
[{"$f":"IF(L363=FALSE,0,COUNTIF(A$3:A362,\">0\")+1)","v":0},"KO-RV280014","Leürítő 1/4\"","300,-Ft ","KONF",null,null,null,300]
[{"$f":"IF(L364=FALSE,0,COUNTIF(A$3:A363,\">0\")+1)","v":0},"KO-RV280038","Leürítő 3/8\"","320,-Ft ","KONF",null,null,null,320]
[{"$f":"IF(L365=FALSE,0,COUNTIF(A$3:A364,\">0\")+1)","v":0},"CO-212140","MDR 1/11, F4 G1/4\", E/A  nyomáskapcsoló   ","6 500,-Ft ","CONDOR","Nyomáskapcsoló",null,null,6500]
[{"$f":"IF(L366=FALSE,0,COUNTIF(A$3:A365,\">0\")+1)","v":0},"CO-218500","MDR-2/11 Nyomáskapcsoló","8 880,-Ft ","CONDOR","Nyomáskapcsoló",null,null,8880]
[{"$f":"IF(L367=FALSE,0,COUNTIF(A$3:A366,\">0\")+1)","v":0},"CO-218937","MDR-3/11-6,3  Nyomáskapcsoló","17 990,-Ft ","CONDOR","Nyomáskapcsoló",null,null,17990]
[{"$f":"IF(L368=FALSE,0,COUNTIF(A$3:A367,\">0\")+1)","v":0},"CO-218944","MDR-3/11-10  Nyomáskapcsoló","17 990,-Ft ","CONDOR","Nyomáskapcsoló",null,null,17990]
[{"$f":"IF(L369=FALSE,0,COUNTIF(A$3:A368,\">0\")+1)","v":0},"CO-218951","MDR-3/11-16  Nyomáskapcsoló","17 990,-Ft ","CONDOR","Nyomáskapcsoló",null,null,17990]
[{"$f":"IF(L370=FALSE,0,COUNTIF(A$3:A369,\">0\")+1)","v":0},"CO-240686","MDR-3/11-20  Nyomáskapcsoló","17 990,-Ft ","CONDOR","Nyomáskapcsoló",null,null,17990]
[{"$f":"IF(L371=FALSE,0,COUNTIF(A$3:A370,\">0\")+1)","v":0},"CO-240693","MDR-3/11-24  Nyomáskapcsoló",{"$f":"IF(H371=\"SP\",IF(J371>0,\"SP: \"&TEXT(J371*I$1,\"# ###,-Ft  \"),\"SP: \"&TEXT(I371*I$1,\"# ###,-Ft\")),IF(J371>0,\"*(\"&TEXT(I371*I$1,\"# ###,-\")&\") \n\"&TEXT(J371*J$1,\"# ###,-Ft\"),TEXT(I371*I$1,\"# ###,-Ft  \")))","v":"17 990,-Ft "},"CONDOR","Nyomáskapcsoló",null,null,17990]
[{"$f":"IF(L372=FALSE,0,COUNTIF(A$3:A371,\">0\")+1)","v":0},"CO-218630","MDR-5/11-4,2  Nyomáskapcsoló","18 750,-Ft ","CONDOR","Nyomáskapcsoló",null,null,18750]
[{"$f":"IF(L373=FALSE,0,COUNTIF(A$3:A372,\">0\")+1)","v":0},"CO-218593","MDR-5/11-7  Nyomáskapcsoló","18 750,-Ft ","CONDOR","Nyomáskapcsoló",null,null,18750]
[{"$f":"IF(L374=FALSE,0,COUNTIF(A$3:A373,\">0\")+1)","v":0},"CO-218586","MDR-5/11-10,3  Nyomáskapcsoló","18 750,-Ft ","CONDOR","Nyomáskapcsoló",null,null,18750]
[{"$f":"IF(L375=FALSE,0,COUNTIF(A$3:A374,\">0\")+1)","v":0},"CO-218623","MDR-5/11-14  Nyomáskapcsoló","18 750,-Ft ","CONDOR","Nyomáskapcsoló",null,null,18750]
[{"$f":"IF(L376=FALSE,0,COUNTIF(A$3:A375,\">0\")+1)","v":0},"CO-251057","MDR-5/11-18  Nyomáskapcsoló","18 960,-Ft ","CONDOR","Nyomáskapcsoló",null,null,18960]
[{"$f":"IF(L377=FALSE,0,COUNTIF(A$3:A376,\">0\")+1)","v":0},"CO-213086","MDR-53/16  Nyomáskapcsoló","20 270,-Ft ","CONDOR","Nyomáskapcsoló",null,null,20270]
[{"$f":"IF(L378=FALSE,0,COUNTIF(A$3:A377,\">0\")+1)","v":0},"CO-212812","MDR-43/11  Nyomáskapcsoló","15 500,-Ft ","CONDOR","Nyomáskapcsoló",null,null,15500]
[{"$f":"IF(L379=FALSE,0,COUNTIF(A$3:A378,\">0\")+1)","v":0},"CO-201878","EV-5 Lefuvató","3 360,-Ft ","CONDOR","Lefúvató szelep",null,null,3360]
[{"$f":"IF(L380=FALSE,0,COUNTIF(A$3:A379,\">0\")+1)","v":0},"CO-201069","EV-3S Lefuvató","2 270,-Ft ","CONDOR","Lefúvató szelep",null,null,2270]
[{"$f":"IF(L381=FALSE,0,COUNTIF(A$3:A380,\">0\")+1)","v":0},"CO-200680","EV-2S Lefuvató","2 270,-Ft ","CONDOR","Lefúvató szelep",null,null,2270]
[{"$f":"IF(L382=FALSE,0,COUNTIF(A$3:A381,\">0\")+1)","v":0},"CO-226765","EV-1S Lefuvató","2 170,-Ft ","CONDOR","Lefúvató szelep",null,null,2170]
[{"$f":"IF(L383=FALSE,0,COUNTIF(A$3:A382,\">0\")+1)","v":0},"CO-201441","Túláram relé R3/6,3A                      ","8 450,-Ft ","CONDOR","Túláram relé",null,null,8450]
[{"$f":"IF(L384=FALSE,0,COUNTIF(A$3:A383,\">0\")+1)","v":0},"CO-201458","Túláram relé R3/10,0                   ",{"$f":"IF(H384=\"SP\",IF(J384>0,\"SP: \"&TEXT(J384*I$1,\"# ###,-Ft  \"),\"SP: \"&TEXT(I384*I$1,\"# ###,-Ft\")),IF(J384>0,\"*(\"&TEXT(I384*I$1,\"# ###,-\")&\") \n\"&TEXT(J384*J$1,\"# ###,-Ft\"),TEXT(I384*I$1,\"# ###,-Ft  \")))","v":"8 450,-Ft "},"CONDOR","Túláram relé",null,null,8450]
[{"$f":"IF(L385=FALSE,0,COUNTIF(A$3:A384,\">0\")+1)","v":0},"CO-201465","Túláram relé R3/16A                       ","8 450,-Ft ","CONDOR","Túláram relé",null,null,8450]
[{"$f":"IF(L386=FALSE,0,COUNTIF(A$3:A385,\">0\")+1)","v":0},"CO-201472","Túláram relé R3/20A                       ","8 450,-Ft ","CONDOR","Túláram relé",null,null,8450]
[{"$f":"IF(L387=FALSE,0,COUNTIF(A$3:A386,\">0\")+1)","v":0},"CO-201489","Túláram relé R3/24A                       ","8 450,-Ft ","CONDOR","Túláram relé",null,null,8450]
[{"$f":"IF(L388=FALSE,0,COUNTIF(A$3:A387,\">0\")+1)","v":0},"CO-202042","Túláram relé R5/4,2A                      ","7 480,-Ft ","CONDOR","Túláram relé",null,null,7480]
[{"$f":"IF(L389=FALSE,0,COUNTIF(A$3:A388,\">0\")+1)","v":0},"CO-202059","Túláram relé R5/7A                        ","7 480,-Ft ","CONDOR","Túláram relé",null,null,7480]
[{"$f":"IF(L390=FALSE,0,COUNTIF(A$3:A389,\">0\")+1)","v":0},"CO-202066","Túláram relé R5/10,3                      ","8 130,-Ft ","CONDOR","Túláram relé",null,null,8130]
[{"$f":"IF(L391=FALSE,0,COUNTIF(A$3:A390,\">0\")+1)","v":0},"CO-202073","Túláram relé R5/14,0                  ","8 130,-Ft ","CONDOR","Túláram relé",null,null,8130]
[{"$f":"IF(L392=FALSE,0,COUNTIF(A$3:A391,\">0\")+1)","v":0},"CO-202080","Túláram relé R5/18A                       ","8 560,-Ft ","CONDOR","Túláram relé",null,null,8560]
[{"$f":"IF(L393=FALSE,0,COUNTIF(A$3:A392,\">0\")+1)","v":0},"CO-253235","MDR 3/16 16A","18 310,-Ft ","CONDOR","Nyomáskapcsoló",null,null,18310]
[{"$f":"IF(L394=FALSE,0,COUNTIF(A$3:A393,\">0\")+1)","v":0},"CO-279679","MDR 3/25 16A","18 310,-Ft ","CONDOR","Nyomáskapcsoló",null,null,18310]
[{"$f":"IF(L395=FALSE,0,COUNTIF(A$3:A394,\">0\")+1)","v":0},"CO-260257","EDS16","29 340,-Ft ","CONDOR","Nyomásjeladó",null,null,29340]
[{"$f":"IF(L396=FALSE,0,COUNTIF(A$3:A395,\">0\")+1)","v":0},"CO-260226","EDI 16","30 410,-Ft ","CONDOR","Nyomásjeladó",null,null,30410]
[{"$f":"IF(L397=FALSE,0,COUNTIF(A$3:A396,\">0\")+1)","v":0},"CO-260288","EDR 16","29 340,-Ft ","CONDOR","Nyomáskapcsoló",null,null,29340]
[{"$f":"IF(L398=FALSE,0,COUNTIF(A$3:A397,\">0\")+1)","v":0},"COUORASZ","Üzemóra számláló",{"$f":"IF(H398=\"SP\",IF(J398>0,\"SP: \"&TEXT(J398*I$1,\"# ###,-Ft  \"),\"SP: \"&TEXT(I398*I$1,\"# ###,-Ft\")),IF(J398>0,\"*(\"&TEXT(I398*I$1,\"# ###,-\")&\") \n\"&TEXT(J398*J$1,\"# ###,-Ft\"),TEXT(I398*I$1,\"# ###,-Ft  \")))","v":"8 661,-Ft "},"CONDOR","Nyomáskapcsoló",null,null,8661.41]
[{"$f":"IF(L399=FALSE,0,COUNTIF(A$3:A398,\">0\")+1)","v":0},6218739200,"B2800 2-3HP","47 500,-Ft ","ABAC","Sűrítő",null,null,47500]
[{"$f":"IF(L400=FALSE,0,COUNTIF(A$3:A399,\">0\")+1)","v":0},4116090308,"A29B Sűrítő","57 500,-Ft ","ABAC","Sűrítő",null,null,57500]
[{"$f":"IF(L401=FALSE,0,COUNTIF(A$3:A400,\">0\")+1)","v":0},4116090310,"A39B Sűrítő","72 900,-Ft ","ABAC","Sűrítő",null,null,72900]
[{"$f":"IF(L402=FALSE,0,COUNTIF(A$3:A401,\">0\")+1)","v":0},6218739400,"B3800 /GR.NS18","80 000,-Ft ","ABAC","Sűrítő",null,null,80000]
[{"$f":"IF(L403=FALSE,0,COUNTIF(A$3:A402,\">0\")+1)","v":0},6218739600,"BLOCK BD 4HP PRO (B4900)","93 000,-Ft ","ABAC","Sűrítő",null,null,93000]
[{"$f":"IF(L404=FALSE,0,COUNTIF(A$3:A403,\">0\")+1)","v":0},6218740200,"BLOCK BD 6HP ME (B5900)","119 000,-Ft ","ABAC","Sűrítő",null,null,119000]
[{"$f":"IF(L405=FALSE,0,COUNTIF(A$3:A404,\">0\")+1)","v":0},6218740100,"BLOCK BD 8HP ME (B6000)","149 000,-Ft ","ABAC","Sűrítő",null,null,149000]
[{"$f":"IF(L406=FALSE,0,COUNTIF(A$3:A405,\">0\")+1)","v":0},6218740000,"BLOCK BD 10HP ME (B7000)","179 000,-Ft ","ABAC","Sűrítő",null,null,179000]
[{"$f":"IF(L407=FALSE,0,COUNTIF(A$3:A406,\">0\")+1)","v":0},6210718900,"Visszacsapó 1/2\"-3/8-10","3 040,-Ft ",null,null,null,null,3040]
[{"$f":"IF(L408=FALSE,0,COUNTIF(A$3:A407,\">0\")+1)","v":0},2236110859,"Visszacsapó 1/2\"-1/2\"","11 260,-Ft ",null,null,null,null,11260]
[{"$f":"IF(L409=FALSE,0,COUNTIF(A$3:A408,\">0\")+1)","v":0},2236110535,"Visszacsapó 3/4\"- 3/8\"","12 090,-Ft ",null,null,null,null,12090]
[{"$f":"IF(L410=FALSE,0,COUNTIF(A$3:A409,\">0\")+1)","v":0},2236110537,"Visszacsapó 3/4\"- 1/2\"","4 710,-Ft ",null,null,null,null,4710]
[{"$f":"IF(L411=FALSE,0,COUNTIF(A$3:A410,\">0\")+1)","v":0},"6210719100","Visszacsapó 3/4\"-BM3/4\"","8 950,-Ft ",null,null,null,null,8950]
[{"$f":"IF(L412=FALSE,0,COUNTIF(A$3:A411,\">0\")+1)","v":0},6210718500,"Visszacsapó 1\"-3/4\"","8 950,-Ft ",null,null,null,null,8950]
[{"$f":"IF(L413=FALSE,0,COUNTIF(A$3:A412,\">0\")+1)","v":0},6210718300,"Visszacsapó 1\"-1\" ","14 700,-Ft ",null,null,null,null,14700]
[{"$f":"IF(L414=FALSE,0,COUNTIF(A$3:A413,\">0\")+1)","v":0},"ALGUMITONK1","Gumitönk Kicsi","1 060,-Ft ",null,null,null,null,1060]
[{"$f":"IF(L415=FALSE,0,COUNTIF(A$3:A414,\">0\")+1)","v":0},"ALGUMITONK2","Gumitönk Közepes","1 620,-Ft ",null,null,null,null,1620]
[{"$f":"IF(L416=FALSE,0,COUNTIF(A$3:A415,\">0\")+1)","v":0},"ALGUMITONK3","Gumitönk Nagy","2 270,-Ft ",null,null,null,null,2270]
[{"$f":"IF(L417=FALSE,0,COUNTIF(A$3:A416,\">0\")+1)","v":0},6210719500,"Biztonsági szelep 1/4\", 8 bar","2 530,-Ft ",null,null,null,null,2530]
[{"$f":"IF(L418=FALSE,0,COUNTIF(A$3:A417,\">0\")+1)","v":0},6210719900,"Biztonsági szelep 3/8\", 11 bar","4 000,-Ft ",null,null,null,null,4000]
[{"$f":"IF(L419=FALSE,0,COUNTIF(A$3:A418,\">0\")+1)","v":0},2236100087,"Biztonsági szelep 3/4\", 11 bar","10 310,-Ft ",null,null,null,null,10310]
[{"$f":"IF(L420=FALSE,0,COUNTIF(A$3:A419,\">0\")+1)","v":0},6214344100,"Szűrő-szabályozó Micro 1/4","9 380,-Ft ",null,null,null,null,9380]
[{"$f":"IF(L421=FALSE,0,COUNTIF(A$3:A420,\">0\")+1)","v":0},6214344200,"Szűrő-szabályozó Mignon 3/8","9 940,-Ft ",null,null,null,null,9940]
[{"$f":"IF(L422=FALSE,0,COUNTIF(A$3:A421,\">0\")+1)","v":0},6214345100,"Szűrő-szabályozó PU4 1/2","15 360,-Ft ",null,null,null,null,15360]
[{"$f":"IF(L423=FALSE,0,COUNTIF(A$3:A422,\">0\")+1)","v":0},6211453700,"Levegőszűrő GV34","1 530,-Ft ",null,null,null,null,1530]
[{"$f":"IF(L424=FALSE,0,COUNTIF(A$3:A423,\">0\")+1)","v":0},6211471500,"Levegőszűrő B28/B3800/B4900","1 930,-Ft ",null,null,null,null,1930]
[{"$f":"IF(L425=FALSE,0,COUNTIF(A$3:A424,\">0\")+1)","v":0},2236111635,"Levegőszűrő A29/A39","2 270,-Ft ",null,null,null,null,2270]
[{"$f":"IF(L426=FALSE,0,COUNTIF(A$3:A425,\">0\")+1)","v":0},"AB-8973005860","Levegőszűrő 3/8\"","940,-Ft ",null,null,null,null,940]
[{"$f":"IF(L427=FALSE,0,COUNTIF(A$3:A426,\">0\")+1)","v":0},"AL8973035810","Levegőszűrő 1/2\"","940,-Ft ",null,null,null,null,940]
[{"$f":"IF(L428=FALSE,0,COUNTIF(A$3:A426,\">0\")+1)","v":0},6211452400,"Levegőszűrő B5900","8 350,-Ft ",null,null,null,null,8350]
[{"$f":"IF(L429=FALSE,0,COUNTIF(A$3:A428,\">0\")+1)","v":0},2236110427,"Levegőszűrő B6000","15 060,-Ft ",null,null,null,null,15060]
[{"$f":"IF(L430=FALSE,0,COUNTIF(A$3:A429,\">0\")+1)","v":0},2236110428,"Levegőszűrő B7000","17 480,-Ft ",null,null,null,null,17480]
[{"$f":"IF(L431=FALSE,0,COUNTIF(A$3:A430,\">0\")+1)","v":0},8973015500,"Levegőszűrő betét B6000/B7000","5 660,-Ft ",null,null,null,null,5660]
[{"$f":"IF(L432=FALSE,0,COUNTIF(A$3:A431,\">0\")+1)","v":0},1121010040,"MULTIBOX COMPRESSOR","99 000,-Ft ","ABAC","Kompresszor",4500,null,99000]
[{"$f":"IF(L433=FALSE,0,COUNTIF(A$3:A432,\">0\")+1)","v":0},1121010041,"MULTIBOX COMBY","124 000,-Ft ","ABAC","Kompresszor",9500,null,124000]
[{"$f":"IF(L434=FALSE,0,COUNTIF(A$3:A433,\">0\")+1)","v":0},4116024261,"A29 27 CM2   ","133 400,-Ft ","ABAC","Kompresszor",43000,null,133400]
[{"$f":"IF(L435=FALSE,0,COUNTIF(A$3:A434,\">0\")+1)","v":0},4116024262,"A29 50 CM2   ","139 700,-Ft ","ABAC","Kompresszor",49000,null,139700]
[{"$f":"IF(L436=FALSE,0,COUNTIF(A$3:A435,\">0\")+1)","v":0},4116024335,"A29 90 CM2   ","150 800,-Ft ","ABAC","Kompresszor",56000,null,150800]
[{"$f":"IF(L437=FALSE,0,COUNTIF(A$3:A436,\">0\")+1)","v":0},4116024254,"A29 150 CM2   ","166 500,-Ft ","ABAC","Kompresszor",87000,null,166500]
[{"$f":"IF(L438=FALSE,0,COUNTIF(A$3:A437,\">0\")+1)","v":0},4116024257,"A29B 50 CM3   ",{"$f":"IF(H438=\"SP\",IF(J438>0,\"SP: \"&TEXT(J438*I$1,\"# ###,-Ft  \"),\"SP: \"&TEXT(I438*I$1,\"# ###,-Ft\")),IF(J438>0,\"*(\"&TEXT(I438*I$1,\"# ###,-\")&\") \n\"&TEXT(J438*J$1,\"# ###,-Ft\"),TEXT(I438*I$1,\"# ###,-Ft  \")))","v":"150 400,-Ft "},"ABAC","Kompresszor",58000,null,150400]
[{"$f":"IF(L439=FALSE,0,COUNTIF(A$3:A438,\">0\")+1)","v":0},4116024531,"A29B 50 CT3   ","150 400,-Ft ","ABAC","Kompresszor",58000,null,150400]
[{"$f":"IF(L440=FALSE,0,COUNTIF(A$3:A439,\">0\")+1)","v":0},4116024363,"A29B 90 CM3   ","165 400,-Ft ","ABAC","Kompresszor",56000,null,165400]
[{"$f":"IF(L441=FALSE,0,COUNTIF(A$3:A440,\">0\")+1)","v":0},4116024518,"A29B 90 CT3   ","158 800,-Ft ","ABAC","Kompresszor",56000,null,158800]
[{"$f":"IF(L442=FALSE,0,COUNTIF(A$3:A441,\">0\")+1)","v":0},4116024137,"A29B 150 CM3   ","184 900,-Ft ","ABAC","Kompresszor",87000,null,184900]
[{"$f":"IF(L443=FALSE,0,COUNTIF(A$3:A442,\">0\")+1)","v":0},4116024138,"A29B 150 CT3   ","184 900,-Ft ","ABAC","Kompresszor",87000,null,184900]
[{"$f":"IF(L444=FALSE,0,COUNTIF(A$3:A443,\">0\")+1)","v":0},4116024534,"A29B 200 CM3   ","199 800,-Ft ","ABAC","Kompresszor",91000,null,199800]
[{"$f":"IF(L445=FALSE,0,COUNTIF(A$3:A444,\">0\")+1)","v":0},4116024535,"A29B 200 CT3   ","199 800,-Ft ","ABAC","Kompresszor",91000,null,199800]
[{"$f":"IF(L446=FALSE,0,COUNTIF(A$3:A445,\">0\")+1)","v":0},4116024519,"A39 90 CM3   ","188 700,-Ft ","ABAC","Kompresszor",72000,null,188700]
[{"$f":"IF(L447=FALSE,0,COUNTIF(A$3:A446,\">0\")+1)","v":0},4116024520,"A39 90 CT3   ","188 700,-Ft ","ABAC","Kompresszor",72000,null,188700]
[{"$f":"IF(L448=FALSE,0,COUNTIF(A$3:A447,\">0\")+1)","v":0},4116024149,"A39 150 CM3   ","204 300,-Ft ","ABAC","Kompresszor",87000,null,204300]
[{"$f":"IF(L449=FALSE,0,COUNTIF(A$3:A448,\">0\")+1)","v":0},4116024150,"A39 150 CT3   ","204 300,-Ft ","ABAC","Kompresszor",87000,null,204300]
[{"$f":"IF(L450=FALSE,0,COUNTIF(A$3:A449,\">0\")+1)","v":0},4116024151,"A39 200 CM3   ","219 400,-Ft ","ABAC","Kompresszor",91000,null,219400]
[{"$f":"IF(L451=FALSE,0,COUNTIF(A$3:A450,\">0\")+1)","v":0},4116024152,"A39 200 CT3   ","219 400,-Ft ","ABAC","Kompresszor",91000,null,219400]
[{"$f":"IF(L452=FALSE,0,COUNTIF(A$3:A451,\">0\")+1)","v":0},4116024548,"A39 270 CM3   ","232 700,-Ft ","ABAC","Kompresszor",138000,null,232700]
[{"$f":"IF(L453=FALSE,0,COUNTIF(A$3:A452,\">0\")+1)","v":0},4116024549,"A39 270 CT3   ","232 700,-Ft ","ABAC","Kompresszor",138000,null,232700]
[{"$f":"IF(L454=FALSE,0,COUNTIF(A$3:A453,\">0\")+1)","v":0},4116024264,"PRO A29B 27 CM2  ","150 800,-Ft ","ABAC","Kompresszor",49000,null,150800]
[{"$f":"IF(L455=FALSE,0,COUNTIF(A$3:A454,\">0\")+1)","v":0},4116024265,"PRO A29B 27 CT2  ","150 800,-Ft ","ABAC","Kompresszor",49000,null,150800]
[{"$f":"IF(L456=FALSE,0,COUNTIF(A$3:A455,\">0\")+1)","v":0},4116024266,"PRO A29B 50 CM2  ","154 300,-Ft ","ABAC","Kompresszor",49000,null,154300]
[{"$f":"IF(L457=FALSE,0,COUNTIF(A$3:A456,\">0\")+1)","v":0},4116024267,"PRO A29B 50 CT2  ","154 300,-Ft ","ABAC","Kompresszor",49000,null,154300]
[{"$f":"IF(L458=FALSE,0,COUNTIF(A$3:A457,\">0\")+1)","v":0},4116024568,"PRO A29B 100 CM2","172 700,-Ft ","ABAC","Kompresszor",56000,null,172700]
[{"$f":"IF(L459=FALSE,0,COUNTIF(A$3:A458,\">0\")+1)","v":0},4116024569,"PRO A29B 100 CT2","172 700,-Ft ","ABAC","Kompresszor",56000,null,172700]
[{"$f":"IF(L460=FALSE,0,COUNTIF(A$3:A459,\">0\")+1)","v":0},4116024536,"PRO A29B 150 CM2  ","184 900,-Ft ","ABAC","Kompresszor",87000,null,184900]
[{"$f":"IF(L461=FALSE,0,COUNTIF(A$3:A460,\">0\")+1)","v":0},4116024537,"PRO A29B 150 CT2  ","184 900,-Ft ","ABAC","Kompresszor",87000,null,184900]
[{"$f":"IF(L462=FALSE,0,COUNTIF(A$3:A461,\">0\")+1)","v":0},4116024523,"PRO A39B 90 CM3  ","190 800,-Ft ","ABAC","Kompresszor",72000,null,190800]
[{"$f":"IF(L463=FALSE,0,COUNTIF(A$3:A462,\">0\")+1)","v":0},4116024524,"PRO A39B 90 CT3  ","190 800,-Ft ","ABAC","Kompresszor",72000,null,190800]
[{"$f":"IF(L464=FALSE,0,COUNTIF(A$3:A463,\">0\")+1)","v":0},4116024614,"PRO A39B 90 CT4 ","196 300,-Ft ","ABAC","Kompresszor",null,null,196300]
[{"$f":"IF(L465=FALSE,0,COUNTIF(A$3:A464,\">0\")+1)","v":0},4116024280,"PRO A39B 150 CM3  ","207 300,-Ft ","ABAC","Kompresszor",87000,null,207300]
[{"$f":"IF(L466=FALSE,0,COUNTIF(A$3:A465,\">0\")+1)","v":0},4116024281,"PRO A39B 150 CT3  ","207 300,-Ft ","ABAC","Kompresszor",87000,null,207300]
[{"$f":"IF(L467=FALSE,0,COUNTIF(A$3:A466,\">0\")+1)","v":0},4116024282,"PRO A39B 200 CM3  ","231 600,-Ft ","ABAC","Kompresszor",91000,null,231600]
[{"$f":"IF(L468=FALSE,0,COUNTIF(A$3:A467,\">0\")+1)","v":0},4116024283,"PRO A39B 200 CT3  ","231 600,-Ft ","ABAC","Kompresszor",91000,null,231600]
[{"$f":"IF(L469=FALSE,0,COUNTIF(A$3:A468,\">0\")+1)","v":0},4116024285,"PRO A39B 270 CM3  ","246 200,-Ft ","ABAC","Kompresszor",138000,null,246200]
[{"$f":"IF(L470=FALSE,0,COUNTIF(A$3:A469,\">0\")+1)","v":0},4116024286,"PRO A39B 270 CT3  ","246 200,-Ft ","ABAC","Kompresszor",138000,null,246200]
[{"$f":"IF(L471=FALSE,0,COUNTIF(A$3:A470,\">0\")+1)","v":0},4116024166,"PRO A39B 200 CT4  ","237 000,-Ft ","ABAC","Kompresszor",91000,null,237000]
[{"$f":"IF(L472=FALSE,0,COUNTIF(A$3:A471,\">0\")+1)","v":0},4116024287,"PRO A39B 270 CT4  ","254 900,-Ft ","ABAC","Kompresszor",138000,null,254900]
[{"$f":"IF(L473=FALSE,0,COUNTIF(A$3:A472,\">0\")+1)","v":0},4116019571,"PRO B4900 200 CT4  ","264 400,-Ft ","ABAC","Kompresszor",140000,null,264400]
[{"$f":"IF(L474=FALSE,0,COUNTIF(A$3:A473,\">0\")+1)","v":0},4116019576,"PRO B4900 200 FT4  ","266 000,-Ft ","ABAC","Kompresszor",137000,null,266000]
[{"$f":"IF(L475=FALSE,0,COUNTIF(A$3:A474,\">0\")+1)","v":0},4116019626,"PRO B4900 270 CT4  ","304 700,-Ft ","ABAC","Kompresszor",147000,null,304700]
[{"$f":"IF(L476=FALSE,0,COUNTIF(A$3:A475,\">0\")+1)","v":0},4116019632,"PRO B4900 270 FT4  ","290 300,-Ft ","ABAC","Kompresszor",144000,null,290300]
[{"$f":"IF(L477=FALSE,0,COUNTIF(A$3:A476,\">0\")+1)","v":0},4116019556,"B4900 90 CT4  15bar","264 500,-Ft ","ABAC","Kompresszor",null,null,264500]
[{"$f":"IF(L478=FALSE,0,COUNTIF(A$3:A477,\">0\")+1)","v":0},4116019696,"PRO B5900B 200 CT5,5  ","333 000,-Ft ","ABAC","Kompresszor",164000,null,333000]
[{"$f":"IF(L479=FALSE,0,COUNTIF(A$3:A478,\">0\")+1)","v":0},4116019700,"PRO B5900B 200 FT5,5  ","330 000,-Ft ","ABAC","Kompresszor",161000,null,330000]
[{"$f":"IF(L480=FALSE,0,COUNTIF(A$3:A479,\">0\")+1)","v":0},4116019770,"PRO B5900B 270 CT5,5  ",{"$f":"IF(H480=\"SP\",IF(J480>0,\"SP: \"&TEXT(J480*I$1,\"# ###,-Ft  \"),\"SP: \"&TEXT(I480*I$1,\"# ###,-Ft\")),IF(J480>0,\"*(\"&TEXT(I480*I$1,\"# ###,-\")&\") \n\"&TEXT(J480*J$1,\"# ###,-Ft\"),TEXT(I480*I$1,\"# ###,-Ft  \")))","v":"352 500,-Ft "},"ABAC","Kompresszor",170000,null,352500]
[{"$f":"IF(L481=FALSE,0,COUNTIF(A$3:A480,\">0\")+1)","v":0},4116019781,"PRO B5900B 270 FT5,5  ","328 200,-Ft ","ABAC","Kompresszor",167000,null,328200]
[{"$f":"IF(L482=FALSE,0,COUNTIF(A$3:A481,\">0\")+1)","v":0},4116019806,"PRO B5900B 500 CT5,5  ","464 000,-Ft ","ABAC","Kompresszor",222000,null,464000]
[{"$f":"IF(L483=FALSE,0,COUNTIF(A$3:A482,\">0\")+1)","v":0},4116019812,"PRO B5900B 500 FT5,5  ","441 200,-Ft ","ABAC","Kompresszor",219000,null,441200]
[{"$f":"IF(L484=FALSE,0,COUNTIF(A$3:A483,\">0\")+1)","v":0},4116020182,"PRO B6000 270 CT7,5  ","418 400,-Ft ","ABAC","Kompresszor",180000,null,418400]
[{"$f":"IF(L485=FALSE,0,COUNTIF(A$3:A484,\">0\")+1)","v":0},4116020190,"PRO B6000 270 FT7,5  ","402 400,-Ft ","ABAC","Kompresszor",177000,null,402400]
[{"$f":"IF(L486=FALSE,0,COUNTIF(A$3:A485,\">0\")+1)","v":0},4116020226,"PRO B6000 500 CT7,5  ","540 900,-Ft ","ABAC","Kompresszor",263000,null,540900]
[{"$f":"IF(L487=FALSE,0,COUNTIF(A$3:A486,\">0\")+1)","v":0},4116020243,"PRO B6000 500 FT7,5  ","494 200,-Ft ","ABAC","Kompresszor",260000,null,494200]
[{"$f":"IF(L488=FALSE,0,COUNTIF(A$3:A487,\">0\")+1)","v":0},4116020782,"PRO B7000 270 CT10  ","517 900,-Ft ","ABAC","Kompresszor",199000,null,517900]
[{"$f":"IF(L489=FALSE,0,COUNTIF(A$3:A488,\">0\")+1)","v":0},4116020790,"PRO B7000 270 FT10  ","515 100,-Ft ","ABAC","Kompresszor",196000,null,515100]
[{"$f":"IF(L490=FALSE,0,COUNTIF(A$3:A489,\">0\")+1)","v":0},4116020835,"PRO B7000 500 CT10  ","601 900,-Ft ","ABAC","Kompresszor",282000,null,601900]
[{"$f":"IF(L491=FALSE,0,COUNTIF(A$3:A490,\">0\")+1)","v":0},4116020855,"PRO B7000 500 FT10  ","580 500,-Ft ","ABAC","Kompresszor",279000,null,580500]
[{"$f":"IF(L492=FALSE,0,COUNTIF(A$3:A491,\">0\")+1)","v":0},4116020796,"PRO B7000 900 FT10  ","737 400,-Ft ","ABAC","Kompresszor",337000,null,737400]
[{"$f":"IF(L493=FALSE,0,COUNTIF(A$3:A492,\">0\")+1)","v":0},4116020179,"PRO B6000 270 CT5,5  ","398 500,-Ft ","ABAC","Kompresszor",171000,null,398500]
[{"$f":"IF(L494=FALSE,0,COUNTIF(A$3:A493,\">0\")+1)","v":0},4116020225,"PRO B6000 500 CT5,5  ","498 200,-Ft ","ABAC","Kompresszor",232000,null,498200]
[{"$f":"IF(L495=FALSE,0,COUNTIF(A$3:A494,\">0\")+1)","v":0},4116020242,"PRO B6000 500 FT5,5  ","481 400,-Ft ","ABAC","Kompresszor",229000,null,481400]
[{"$f":"IF(L496=FALSE,0,COUNTIF(A$3:A495,\">0\")+1)","v":0},4116020778,"PRO B7000 270 CT7,5  ","498 200,-Ft ","ABAC","Kompresszor",194000,null,498200]
[{"$f":"IF(L497=FALSE,0,COUNTIF(A$3:A496,\">0\")+1)","v":0},4116020789,"PRO B7000 270 FT7,5  ","481 400,-Ft ","ABAC","Kompresszor",191000,null,481400]
[{"$f":"IF(L498=FALSE,0,COUNTIF(A$3:A497,\">0\")+1)","v":0},4116020834,"PRO B7000 500 CT7,5  ","589 300,-Ft ","ABAC","Kompresszor",277000,null,589300]
[{"$f":"IF(L499=FALSE,0,COUNTIF(A$3:A498,\">0\")+1)","v":0},4116020852,"PRO B7000 500 FT7,5  ","566 700,-Ft ","ABAC","Kompresszor",274000,null,566700]
[{"$f":"IF(L500=FALSE,0,COUNTIF(A$3:A499,\">0\")+1)","v":0},4116000158,"B4900 270 FT4 FFO  ","568 500,-Ft ","ABAC","Kompresszor",174000,null,568500]
[{"$f":"IF(L501=FALSE,0,COUNTIF(A$3:A500,\">0\")+1)","v":0},4116000159,"B5900B 270 FT5,5 FFO  ","615 500,-Ft ","ABAC","Kompresszor",197000,null,615500]
[{"$f":"IF(L502=FALSE,0,COUNTIF(A$3:A501,\">0\")+1)","v":0},4116000171,"B5900B 270 FT5,5 FFO YD ","723 700,-Ft ","ABAC","Kompresszor",197000,null,723700]
[{"$f":"IF(L503=FALSE,0,COUNTIF(A$3:A502,\">0\")+1)","v":0},4116000165,"B5900B 500 FT5,5 FFO  ","715 600,-Ft ","ABAC","Kompresszor",249000,null,715600]
[{"$f":"IF(L504=FALSE,0,COUNTIF(A$3:A503,\">0\")+1)","v":0},4116000172,"B5900B 500 FT5,5 FFO YD ","823 600,-Ft ","ABAC","Kompresszor",249000,null,823600]
[{"$f":"IF(L505=FALSE,0,COUNTIF(A$3:A504,\">0\")+1)","v":0},4116000166,"B6000 270 FT7,5 FFO  ","735 700,-Ft ","ABAC","Kompresszor",207000,null,735700]
[{"$f":"IF(L506=FALSE,0,COUNTIF(A$3:A505,\">0\")+1)","v":0},4116000173,"B6000 270 FT7,5 FFO YD ","843 800,-Ft ","ABAC","Kompresszor",207000,null,843800]
[{"$f":"IF(L507=FALSE,0,COUNTIF(A$3:A506,\">0\")+1)","v":0},4116000167,"B6000 500 FT7,5 FFO  ","830 300,-Ft ","ABAC","Kompresszor",290000,null,830300]
[{"$f":"IF(L508=FALSE,0,COUNTIF(A$3:A507,\">0\")+1)","v":0},4116000174,"B6000 500 FT7,5 FFO YD ","938 200,-Ft ","ABAC","Kompresszor",290000,null,938200]
[{"$f":"IF(L509=FALSE,0,COUNTIF(A$3:A508,\">0\")+1)","v":0},4116000168,"B7000 270 FT10 FFO  ","847 100,-Ft ","ABAC","Kompresszor",231000,null,847100]
[{"$f":"IF(L510=FALSE,0,COUNTIF(A$3:A509,\">0\")+1)","v":0},4116000175,"B7000 270 FT10 FFO YD ","955 000,-Ft ","ABAC","Kompresszor",231000,null,955000]
[{"$f":"IF(L511=FALSE,0,COUNTIF(A$3:A510,\">0\")+1)","v":0},4116000169,"B7000 500 FT10 FFO  ","941 200,-Ft ","ABAC","Kompresszor",314000,null,941200]
[{"$f":"IF(L512=FALSE,0,COUNTIF(A$3:A511,\">0\")+1)","v":0},4116000176,"B7000 500 FT10 FFO YD ","1 049 400,-Ft ","ABAC","Kompresszor",314000,null,1049400]
[{"$f":"IF(L513=FALSE,0,COUNTIF(A$3:A512,\">0\")+1)","v":0},4116024163,"PRO A39B 150 VM3  ","270 900,-Ft ","ABAC","Kompresszor",160000,null,270900]
[{"$f":"IF(L514=FALSE,0,COUNTIF(A$3:A513,\">0\")+1)","v":0},4116024162,"PRO A39B 150 VT3  ","270 900,-Ft ","ABAC","Kompresszor",160000,null,270900]
[{"$f":"IF(L515=FALSE,0,COUNTIF(A$3:A514,\">0\")+1)","v":0},4116024560,"PRO B4900 150 VT4  ","340 900,-Ft ","ABAC","Kompresszor",180000,null,340900]
[{"$f":"IF(L516=FALSE,0,COUNTIF(A$3:A515,\">0\")+1)","v":0},4116024561,"PRO B4900 200 VT4  ","367 200,-Ft ","ABAC","Kompresszor",185000,null,367200]
[{"$f":"IF(L517=FALSE,0,COUNTIF(A$3:A516,\">0\")+1)","v":0},4116024563,"PRO B5900B 200 VT5,5  ","413 100,-Ft ","ABAC","Kompresszor",205000,null,413100]
[{"$f":"IF(L518=FALSE,0,COUNTIF(A$3:A517,\">0\")+1)","v":0},4116017006,"PRO B5900B 270 VT5,5  ","461 000,-Ft ","ABAC","Kompresszor",210000,null,461000]
[{"$f":"IF(L519=FALSE,0,COUNTIF(A$3:A518,\">0\")+1)","v":0},4116017001,"PRO B6000 270 VT7,5  ","538 200,-Ft ","ABAC","Kompresszor",242000,null,538200]
[{"$f":"IF(L520=FALSE,0,COUNTIF(A$3:A519,\">0\")+1)","v":0},4116017002,"PRO B7000 270 VT10  ","583 300,-Ft ","ABAC","Kompresszor",261000,null,583300]
[{"$f":"IF(L521=FALSE,0,COUNTIF(A$3:A520,\">0\")+1)","v":0},4116023343,"PRO BV8900 900 FT15  ","2 362 900,-Ft ","ABAC","Kompresszor",535000,null,2362900]
[{"$f":"IF(L522=FALSE,0,COUNTIF(A$3:A521,\">0\")+1)","v":0},4116021614,"PRO BV8900 900 FT20  ","2 420 000,-Ft ","ABAC","Kompresszor",584000,null,2420000]
[{"$f":"IF(L523=FALSE,0,COUNTIF(A$3:A522,\">0\")+1)","v":0},4116019643,"PRO B4900 500 T4  ","711 600,-Ft ","ABAC","Kompresszor",304000,null,711600]
[{"$f":"IF(L524=FALSE,0,COUNTIF(A$3:A523,\">0\")+1)","v":0},4116019884,"PRO B5900 500 T5,5  ","825 800,-Ft ","ABAC","Kompresszor",323000,null,825800]
[{"$f":"IF(L525=FALSE,0,COUNTIF(A$3:A524,\">0\")+1)","v":0},4116020371,"PRO B6000 500 T5,5  ","910 900,-Ft ","ABAC","Kompresszor",325000,null,910900]
[{"$f":"IF(L526=FALSE,0,COUNTIF(A$3:A525,\">0\")+1)","v":0},4116020375,"PRO B6000 500 T7,5  ","982 300,-Ft ","ABAC","Kompresszor",387000,null,982300]
[{"$f":"IF(L527=FALSE,0,COUNTIF(A$3:A526,\">0\")+1)","v":0},4116020203,"PRO B6000 900 T7,5  ","1 110 100,-Ft ","ABAC","Kompresszor",500000,null,1110100]
[{"$f":"IF(L528=FALSE,0,COUNTIF(A$3:A527,\">0\")+1)","v":0},4116020987,"PRO B7000 500 T7,5  ","1 089 000,-Ft ","ABAC","Kompresszor",425000,null,1089000]
[{"$f":"IF(L529=FALSE,0,COUNTIF(A$3:A528,\">0\")+1)","v":0},4116020810,"PRO B7000 900 T10  ","1 195 700,-Ft ","ABAC","Kompresszor",538000,null,1195700]
[{"$f":"IF(L530=FALSE,0,COUNTIF(A$3:A529,\">0\")+1)","v":0},4116020249,"PRO B6000 500 FT7,5 15 bar","687 600,-Ft ","ABAC","Kompresszor",290000,null,687600]
[{"$f":"IF(L531=FALSE,0,COUNTIF(A$3:A530,\">0\")+1)","v":0},4116020860,"PRO B7000 500 FT10 15 bar","794 200,-Ft ","ABAC","Kompresszor",305000,null,794200]
[{"$f":"IF(L532=FALSE,0,COUNTIF(A$3:A531,\">0\")+1)","v":0},4116000103,"B6000 BF7,5    ","481 600,-Ft ","ABAC","Kompresszor",120000,null,481600]
[{"$f":"IF(L533=FALSE,0,COUNTIF(A$3:A532,\">0\")+1)","v":0},4116000013,"B7000 BF10    ","430 700,-Ft ","ABAC","Kompresszor",135000,null,430700]
[{"$f":"IF(L534=FALSE,0,COUNTIF(A$3:A533,\">0\")+1)","v":0},4116000018,"B8900 BF15    ","1 757 600,-Ft ","ABAC","Kompresszor",338000,null,1757600]
[{"$f":"IF(L535=FALSE,0,COUNTIF(A$3:A534,\">0\")+1)","v":0},4116000016,"B8900 BF20    ","1 834 400,-Ft ","ABAC","Kompresszor",350000,null,1834400]
[{"$f":"IF(L536=FALSE,0,COUNTIF(A$3:A535,\">0\")+1)","v":0},4116007346,"S A29B 90 CM2  ","213 100,-Ft ","ABAC","Kompresszor",59000,null,213100]
[{"$f":"IF(L537=FALSE,0,COUNTIF(A$3:A536,\">0\")+1)","v":0},4116007347,"S A29B 90 CT2  ","213 100,-Ft ","ABAC","Kompresszor",59000,null,213100]
[{"$f":"IF(L538=FALSE,0,COUNTIF(A$3:A537,\">0\")+1)","v":0},4116007348,"S A29B 150 CM2  ","230 900,-Ft ","ABAC","Kompresszor",90000,null,230900]
[{"$f":"IF(L539=FALSE,0,COUNTIF(A$3:A538,\">0\")+1)","v":0},4116007349,"S A29B 150 CT2  ","230 900,-Ft ","ABAC","Kompresszor",90000,null,230900]
[{"$f":"IF(L540=FALSE,0,COUNTIF(A$3:A539,\">0\")+1)","v":0},4116007350,"S A39B 150 CM3  ","266 200,-Ft ","ABAC","Kompresszor",90000,null,266200]
[{"$f":"IF(L541=FALSE,0,COUNTIF(A$3:A540,\">0\")+1)","v":0},4116007351,"S A39B 150 CT3  ","266 200,-Ft ","ABAC","Kompresszor",90000,null,266200]
[{"$f":"IF(L542=FALSE,0,COUNTIF(A$3:A541,\">0\")+1)","v":0},4116007352,"S A39B 200 CM3  ","288 600,-Ft ","ABAC","Kompresszor",94000,null,288600]
[{"$f":"IF(L543=FALSE,0,COUNTIF(A$3:A542,\">0\")+1)","v":0},4116007353,"S A39B 200 CT3  ",{"$f":"IF(H543=\"SP\",IF(J543>0,\"SP: \"&TEXT(J543*I$1,\"# ###,-Ft  \"),\"SP: \"&TEXT(I543*I$1,\"# ###,-Ft\")),IF(J543>0,\"*(\"&TEXT(I543*I$1,\"# ###,-\")&\") \n\"&TEXT(J543*J$1,\"# ###,-Ft\"),TEXT(I543*I$1,\"# ###,-Ft  \")))","v":"288 600,-Ft "},"ABAC","Kompresszor",94000,null,288600]
[{"$f":"IF(L544=FALSE,0,COUNTIF(A$3:A543,\">0\")+1)","v":0},4116007354,"S A39B 270 CM3  ","307 300,-Ft ","ABAC","Kompresszor",141000,null,307300]
[{"$f":"IF(L545=FALSE,0,COUNTIF(A$3:A544,\">0\")+1)","v":0},4116007355,"S A39B 270 CT3  ","307 300,-Ft ","ABAC","Kompresszor",141000,null,307300]
[{"$f":"IF(L546=FALSE,0,COUNTIF(A$3:A545,\">0\")+1)","v":0},4116007356,"S A39B 200 CT4  ","305 100,-Ft ","ABAC","Kompresszor",94000,null,305100]
[{"$f":"IF(L547=FALSE,0,COUNTIF(A$3:A546,\">0\")+1)","v":0},4116007357,"S A39B 270 CT4  ","317 900,-Ft ","ABAC","Kompresszor",141000,null,317900]
[{"$f":"IF(L548=FALSE,0,COUNTIF(A$3:A547,\">0\")+1)","v":0},4116007332,"S B4900 270 FT4  ","506 500,-Ft ","ABAC","Kompresszor",154000,null,506500]
[{"$f":"IF(L549=FALSE,0,COUNTIF(A$3:A548,\">0\")+1)","v":0},4116007333,"S B5900B 270 FT5,5  ","571 600,-Ft ","ABAC","Kompresszor",177000,null,571600]
[{"$f":"IF(L550=FALSE,0,COUNTIF(A$3:A549,\">0\")+1)","v":0},4116007335,"S B5900B 270 VT5,5  ","776 900,-Ft ","ABAC","Kompresszor",230000,null,776900]
[{"$f":"IF(L551=FALSE,0,COUNTIF(A$3:A550,\">0\")+1)","v":0},4116007334,"S B5900B 500 FT5,5  ","717 800,-Ft ","ABAC","Kompresszor",229000,null,717800]
[{"$f":"IF(L552=FALSE,0,COUNTIF(A$3:A551,\">0\")+1)","v":0},4116007336,"S B6000 270 FT7,5  ","667 400,-Ft ","ABAC","Kompresszor",187000,null,667400]
[{"$f":"IF(L553=FALSE,0,COUNTIF(A$3:A552,\">0\")+1)","v":0},4116007338,"S B6000 270 VT7,5  ","846 200,-Ft ","ABAC","Kompresszor",250000,null,846200]
[{"$f":"IF(L554=FALSE,0,COUNTIF(A$3:A553,\">0\")+1)","v":0},4116007337,"S B6000 500 FT7,5  ","818 100,-Ft ","ABAC","Kompresszor",270000,null,818100]
[{"$f":"IF(L555=FALSE,0,COUNTIF(A$3:A554,\">0\")+1)","v":0},4116074036,"A29B LN M2   ","315 300,-Ft ","ABAC","Kompresszor",86000,null,315300]
[{"$f":"IF(L556=FALSE,0,COUNTIF(A$3:A555,\">0\")+1)","v":0},4116074037,"A29B LN T2   ","315 300,-Ft ","ABAC","Kompresszor",86000,null,315300]
[{"$f":"IF(L557=FALSE,0,COUNTIF(A$3:A556,\">0\")+1)","v":0},4116074041,"A29B LN M3   ","338 200,-Ft ","ABAC","Kompresszor",87000,null,338200]
[{"$f":"IF(L558=FALSE,0,COUNTIF(A$3:A557,\">0\")+1)","v":0},4116074039,"A29B LN T3   ","338 200,-Ft ","ABAC","Kompresszor",87000,null,338200]
[{"$f":"IF(L559=FALSE,0,COUNTIF(A$3:A558,\">0\")+1)","v":0},4116007011,"B4900 LN T4   ","563 300,-Ft ","ABAC","Kompresszor",170000,null,563300]
[{"$f":"IF(L560=FALSE,0,COUNTIF(A$3:A559,\">0\")+1)","v":0},4116007012,"B5900 LN T5,5   ","631 900,-Ft ","ABAC","Kompresszor",177000,null,631900]
[{"$f":"IF(L561=FALSE,0,COUNTIF(A$3:A560,\">0\")+1)","v":0},4116007014,"B5900 LN T5,5   ","741 800,-Ft ","ABAC","Kompresszor",181000,null,741800]
[{"$f":"IF(L562=FALSE,0,COUNTIF(A$3:A561,\">0\")+1)","v":0},4116007015,"B6000 LN T 7,5  ","747 900,-Ft ","ABAC","Kompresszor",234000,null,747900]
[{"$f":"IF(L563=FALSE,0,COUNTIF(A$3:A562,\">0\")+1)","v":0},4116007016,"B6000 LN T 7,5  ","816 800,-Ft ","ABAC","Kompresszor",240000,null,816800]
[{"$f":"IF(L564=FALSE,0,COUNTIF(A$3:A563,\">0\")+1)","v":0},4116007017,"B7000 LN T 10  ","891 100,-Ft ","ABAC","Kompresszor",253000,null,891100]
[{"$f":"IF(L565=FALSE,0,COUNTIF(A$3:A564,\">0\")+1)","v":0},4116007018,"B7000 LN T 10  ","1 002 500,-Ft ","ABAC","Kompresszor",259000,null,1002500]
[{"$f":"IF(L566=FALSE,0,COUNTIF(A$3:A565,\">0\")+1)","v":0},4116007010,"B4900 LN 270 4  ","728 500,-Ft ","ABAC","Kompresszor",238000,null,728500]
[{"$f":"IF(L567=FALSE,0,COUNTIF(A$3:A566,\">0\")+1)","v":0},4116007001,"B5900 LN 270 5,5  ","750 800,-Ft ","ABAC","Kompresszor",248000,null,750800]
[{"$f":"IF(L568=FALSE,0,COUNTIF(A$3:A567,\">0\")+1)","v":0},4116007002,"B5900 LN 270 5,5  ","862 100,-Ft ","ABAC","Kompresszor",252000,null,862100]
[{"$f":"IF(L569=FALSE,0,COUNTIF(A$3:A568,\">0\")+1)","v":0},4116007003,"B5900 LN 500 5,5  ","794 500,-Ft ","ABAC","Kompresszor",302000,null,794500]
[{"$f":"IF(L570=FALSE,0,COUNTIF(A$3:A569,\">0\")+1)","v":0},4116007004,"B5900 LN 500 5,5  ","905 700,-Ft ","ABAC","Kompresszor",306000,null,905700]
[{"$f":"IF(L571=FALSE,0,COUNTIF(A$3:A570,\">0\")+1)","v":0},4116007005,"B6000 LN 500 7,5  ","1 007 300,-Ft ","ABAC","Kompresszor",404000,null,1007300]
[{"$f":"IF(L572=FALSE,0,COUNTIF(A$3:A571,\">0\")+1)","v":0},4116007006,"B6000 LN 500 7,5  ","1 035 000,-Ft ","ABAC","Kompresszor",410000,null,1035000]
[{"$f":"IF(L573=FALSE,0,COUNTIF(A$3:A572,\">0\")+1)","v":0},4116007007,"B7000 LN 500 10  ","1 055 800,-Ft ","ABAC","Kompresszor",442000,null,1055800]
[{"$f":"IF(L574=FALSE,0,COUNTIF(A$3:A573,\">0\")+1)","v":0},4116007008,"B7000 LN 500 10  ","1 074 100,-Ft ","ABAC","Kompresszor",448000,null,1074100]
[{"$f":"IF(L575=FALSE,0,COUNTIF(A$3:A574,\">0\")+1)","v":0},4116007040,"B5900 LN 500 T 5,5 DRY","1 155 800,-Ft ","ABAC","Kompresszor",302000,null,1155800]
[{"$f":"IF(L576=FALSE,0,COUNTIF(A$3:A575,\">0\")+1)","v":0},4116007041,"B5900 LN 500 T 5,5 DRY","1 264 900,-Ft ","ABAC","Kompresszor",306000,null,1264900]
[{"$f":"IF(L577=FALSE,0,COUNTIF(A$3:A576,\">0\")+1)","v":0},4116007042,"B6000 LN 500 T 7,5 DRY","1 225 900,-Ft ","ABAC","Kompresszor",404000,null,1225900]
[{"$f":"IF(L578=FALSE,0,COUNTIF(A$3:A577,\">0\")+1)","v":0},4116007043,"B6000 LN 500 T 7,5 DRY","1 334 500,-Ft ","ABAC","Kompresszor",410000,null,1334500]
[{"$f":"IF(L579=FALSE,0,COUNTIF(A$3:A578,\">0\")+1)","v":0},4116007044,"B7000 LN 500 T 10 DRY","1 443 700,-Ft ","ABAC","Kompresszor",442000,null,1443700]
[{"$f":"IF(L580=FALSE,0,COUNTIF(A$3:A579,\">0\")+1)","v":0},4116007045,"B7000 LN 500 T 10 DRY","1 551 000,-Ft ","ABAC","Kompresszor",448000,null,1551000]
[{"$f":"IF(L581=FALSE,0,COUNTIF(A$3:A580,\">0\")+1)","v":0},4116023545,"PRO B7900 500 FT10","607 900,-Ft ","ABAC","Kompresszor",null,null,607900]
[{"$f":"IF(L582=FALSE,0,COUNTIF(A$3:A581,\">0\")+1)","v":0},4116024564,"A29B 100 CM3","162 200,-Ft ","ABAC","Kompresszor",null,null,162200]
[{"$f":"IF(L583=FALSE,0,COUNTIF(A$3:A582,\">0\")+1)","v":0},4116024565,"A29B 100 CT3","162 200,-Ft ","ABAC","Kompresszor",null,null,162200]
[{"$f":"IF(L584=FALSE,0,COUNTIF(A$3:A583,\">0\")+1)","v":0},4116024278,"PRO A39B 100 CM3","193 400,-Ft ","ABAC","Kompresszor",null,null,193400]
[{"$f":"IF(L585=FALSE,0,COUNTIF(A$3:A584,\">0\")+1)","v":0},4116024279,"PRO A39B 100 CT3","193 400,-Ft ","ABAC","Kompresszor",null,null,193400]
[{"$f":"IF(L586=FALSE,0,COUNTIF(A$3:A585,\">0\")+1)","v":0},4116019685,"B 5900B/90 CT5 5 DISG.15B ABAC","377 500,-Ft ","ABAC","Kompresszor",null,null,377500]
[{"$f":"IF(L587=FALSE,0,COUNTIF(A$3:A586,\">0\")+1)","v":0},4116021231,"PRO B6000 270 VT7.5 15B","534 200,-Ft ","ABAC","Kompresszor",null,null,534200]
[{"$f":"IF(L588=FALSE,0,COUNTIF(A$3:A587,\">0\")+1)","v":0},4116025181,"PRO CA1 270 FT5,5","549 300,-Ft ","ABAC","Kompresszor",null,null,549300]
[{"$f":"IF(L589=FALSE,0,COUNTIF(A$3:A588,\">0\")+1)","v":0},4116025186,"PRO CA1 500 FT5,5","628 000,-Ft ","ABAC","Kompresszor",null,null,628000]
[{"$f":"IF(L590=FALSE,0,COUNTIF(A$3:A589,\">0\")+1)","v":0},4116025182,"PRO CA1 270 FT7,5","581 800,-Ft ","ABAC","Kompresszor",null,null,581800]
[{"$f":"IF(L591=FALSE,0,COUNTIF(A$3:A590,\">0\")+1)","v":0},4116025183,"PRO CA1 500 FT7,5","662 700,-Ft ","ABAC","Kompresszor",null,null,662700]
[{"$f":"IF(L592=FALSE,0,COUNTIF(A$3:A591,\">0\")+1)","v":0},4116025185,"PRO CA2 500 FT10","698 900,-Ft ","ABAC","Kompresszor",null,null,698900]
[{"$f":"IF(L593=FALSE,0,COUNTIF(A$3:A592,\">0\")+1)","v":0},4116025190,"PRO CA2 500 FT10 YD","878 100,-Ft ","ABAC","Kompresszor",null,null,878100]
[{"$f":"IF(L594=FALSE,0,COUNTIF(A$3:A593,\">0\")+1)","v":0},4116025184,"PRO T CA1 500 FT7,5","1 150 300,-Ft ","ABAC","Kompresszor",null,null,1150300]
[{"$f":"IF(L595=FALSE,0,COUNTIF(A$3:A594,\">0\")+1)","v":0},1129100008,"VENTO B15 baseline","32 100,-Ft ","ABAC","Kompresszor",null,null,32100]
[{"$f":"IF(L596=FALSE,0,COUNTIF(A$3:A595,\">0\")+1)","v":0},1129100009,"POLE POSITION B15 baseline","36 100,-Ft ","ABAC","Kompresszor",null,null,36100]
[{"$f":"IF(L597=FALSE,0,COUNTIF(A$3:A596,\">0\")+1)","v":0},1129100007,"POLE POSITION B20 baseline","37 500,-Ft ","ABAC","Kompresszor",null,null,37500]
[{"$f":"IF(L598=FALSE,0,COUNTIF(A$3:A597,\">0\")+1)","v":0},1129100006,"MONTECARLO B20 baseline","47 900,-Ft ","ABAC","Kompresszor",null,null,47900]
[{"$f":"IF(L599=FALSE,0,COUNTIF(A$3:A598,\">0\")+1)","v":0},1121450003,"B26/50CM2 230/50CE BASELINE","131 400,-Ft ","ABAC","Kompresszor",null,null,131400]
[{"$f":"IF(L600=FALSE,0,COUNTIF(A$3:A599,\">0\")+1)","v":0},1121450004,"B26/90CM2 230/50CE BASELINE","141 000,-Ft ","ABAC","Kompresszor",null,null,141000]
[{"$f":"IF(L601=FALSE,0,COUNTIF(A$3:A600,\">0\")+1)","v":0},1121450005,"B26B/90CM3 230/50CE BASELINE","147 300,-Ft ","ABAC","Kompresszor",null,null,147300]
[{"$f":"IF(L602=FALSE,0,COUNTIF(A$3:A601,\">0\")+1)","v":0},1121450006,"B26B/150 CM3 V230  BASELINE","168 300,-Ft ","ABAC","Kompresszor",null,null,168300]
[{"$f":"IF(L603=FALSE,0,COUNTIF(A$3:A602,\">0\")+1)","v":0},1121450007,"B26B/200 FM3 BASELINE","172 400,-Ft ","ABAC","Kompresszor",null,null,172400]
[{"$f":"IF(L604=FALSE,0,COUNTIF(A$3:A603,\">0\")+1)","v":0},1129100032,"COMPY O15","28 600,-Ft ","ABAC","Kompresszor",null,null,28600]
[{"$f":"IF(L605=FALSE,0,COUNTIF(A$3:A604,\">0\")+1)","v":0},1129100029,"START O15","36 800,-Ft ","ABAC","Kompresszor",null,null,36800]
[{"$f":"IF(L606=FALSE,0,COUNTIF(A$3:A605,\">0\")+1)","v":0},1129100049,"POLE POSITION O15","42 500,-Ft ","ABAC","Kompresszor",null,null,42500]
[{"$f":"IF(L607=FALSE,0,COUNTIF(A$3:A606,\">0\")+1)","v":0},1129100034,"START L20","38 900,-Ft ","ABAC","Kompresszor",null,null,38900]
[{"$f":"IF(L608=FALSE,0,COUNTIF(A$3:A607,\">0\")+1)","v":0},1129100021,"POLE POSITION L20 új","42 100,-Ft ","ABAC","Kompresszor",null,null,42100]
[{"$f":"IF(L609=FALSE,0,COUNTIF(A$3:A608,\">0\")+1)","v":0},1129100023,"MONTECARLO L20 új","54 200,-Ft ","ABAC","Kompresszor",null,null,54200]
[{"$f":"IF(L610=FALSE,0,COUNTIF(A$3:A609,\">0\")+1)","v":0},1121020389,"START SILENT O10P","78 000,-Ft ","ABAC","Kompresszor",null,null,78000]
[{"$f":"IF(L611=FALSE,0,COUNTIF(A$3:A610,\">0\")+1)","v":0},1121020388,"START O20P","49 800,-Ft ","ABAC","Kompresszor",null,null,49800]
[{"$f":"IF(L612=FALSE,0,COUNTIF(A$3:A611,\">0\")+1)","v":0},1121210969,"POLE POSITION O20P","55 500,-Ft ","ABAC","Kompresszor",null,null,55500]
[{"$f":"IF(L613=FALSE,0,COUNTIF(A$3:A612,\">0\")+1)","v":0},1121360898,"MONTECARLO O20P","68 400,-Ft ","ABAC","Kompresszor",null,null,68400]
[{"$f":"IF(L614=FALSE,0,COUNTIF(A$3:A613,\">0\")+1)","v":0},1129100042,"POLE POSITION L25P","59 800,-Ft ","ABAC","Kompresszor",null,null,59800]
[{"$f":"IF(L615=FALSE,0,COUNTIF(A$3:A614,\">0\")+1)","v":0},1129100048,"MONTECARLO L25P","76 600,-Ft ","ABAC","Kompresszor",null,null,76600]
[{"$f":"IF(L616=FALSE,0,COUNTIF(A$3:A615,\">0\")+1)","v":0},1129100045,"POLE POSITION L30P","76 400,-Ft ","ABAC","Kompresszor",null,null,76400]
[{"$f":"IF(L617=FALSE,0,COUNTIF(A$3:A616,\">0\")+1)","v":0},1129100037,"MONTECARLO L30P","87 600,-Ft ","ABAC","Kompresszor",null,null,87600]
[{"$f":"IF(L618=FALSE,0,COUNTIF(A$3:A617,\">0\")+1)","v":0},1121390600,"ESTORIL L30P","110 300,-Ft ","ABAC","Kompresszor",null,null,110300]
[{"$f":"IF(L619=FALSE,0,COUNTIF(A$3:A618,\">0\")+1)","v":0},1121020309,"START ROLLCAGE O20P","80 700,-Ft ","ABAC","Kompresszor",null,null,80700]
[{"$f":"IF(L620=FALSE,0,COUNTIF(A$3:A619,\">0\")+1)","v":0},1121090033,"SILVERSTONE O20P","78 400,-Ft ","ABAC","Kompresszor",null,null,78400]
[{"$f":"IF(L621=FALSE,0,COUNTIF(A$3:A620,\">0\")+1)","v":0},8973005553,"MINI 20 AUTOM.","105 200,-Ft ","ABAC","Kompresszor",null,null,105200]
[{"$f":"IF(L622=FALSE,0,COUNTIF(A$3:A621,\">0\")+1)","v":0},8973005554,"JUNIOR 30 AUT.","119 500,-Ft ","ABAC","Kompresszor",null,null,119500]
[{"$f":"IF(L623=FALSE,0,COUNTIF(A$3:A622,\">0\")+1)","v":0},8973005552,"PRO 50","167 600,-Ft ","ABAC","Kompresszor",null,null,167600]
[{"$f":"IF(L624=FALSE,0,COUNTIF(A$3:A623,\">0\")+1)","v":0},1129100051,"START ROLLCAGE L25P","79 000,-Ft ","ABAC","Kompresszor",null,null,79000]
[{"$f":"IF(L625=FALSE,0,COUNTIF(A$3:A624,\">0\")+1)","v":0},1129100062,"SILVERSTONE L25P","80 800,-Ft ","ABAC","Kompresszor",null,null,80800]
[{"$f":"IF(L626=FALSE,0,COUNTIF(A$3:A625,\">0\")+1)","v":0},1129100060,"PORTABLE ROLLCAGE L30P","118 000,-Ft ","ABAC","Kompresszor",null,null,118000]
[{"$f":"IF(L627=FALSE,0,COUNTIF(A$3:A626,\">0\")+1)","v":0},1129100063,"HOCKENHEIM L30P","112 100,-Ft ","ABAC","Kompresszor",null,null,112100]
[{"$f":"IF(L628=FALSE,0,COUNTIF(A$3:A627,\">0\")+1)","v":0},1121440197,"V30/9+9 CM 3","251 500,-Ft ","ABAC","Kompresszor",null,null,251500]
[{"$f":"IF(L629=FALSE,0,COUNTIF(A$3:A628,\">0\")+1)","v":0},1121090851,"V30/20 PCM 3","205 200,-Ft ","ABAC","Kompresszor",null,null,205200]
[{"$f":"IF(L630=FALSE,0,COUNTIF(A$3:A629,\">0\")+1)","v":0},1121430329,"V30/50 VERTICAL CM3","220 200,-Ft ","ABAC","Kompresszor",null,null,220200]
[{"$f":"IF(L631=FALSE,0,COUNTIF(A$3:A630,\">0\")+1)","v":0},1121360249,"V30/50  CM 3","184 500,-Ft ","ABAC","Kompresszor",null,null,184500]
[{"$f":"IF(L632=FALSE,0,COUNTIF(A$3:A631,\">0\")+1)","v":0},1121370226,"V30/90 CM 3","197 800,-Ft ","ABAC","Kompresszor",null,null,197800]
[{"$f":"IF(L633=FALSE,0,COUNTIF(A$3:A632,\">0\")+1)","v":0},4116092295,"SLN 270 FT4","594 500,-Ft ","ABAC","Kompresszor",null,null,594500]
[{"$f":"IF(L634=FALSE,0,COUNTIF(A$3:A633,\">0\")+1)","v":0},4116092297,"SLN 270 FT4 15B","667 400,-Ft ","ABAC","Kompresszor",null,null,667400]
[{"$f":"IF(L635=FALSE,0,COUNTIF(A$3:A634,\">0\")+1)","v":0},4116092296,"SLN 270V FT4","681 900,-Ft ","ABAC","Kompresszor",null,null,681900]
[{"$f":"IF(L636=FALSE,0,COUNTIF(A$3:A635,\">0\")+1)","v":0},4116092298,"SLN 270 FT5,5","740 100,-Ft ","ABAC","Kompresszor",null,null,740100]
[{"$f":"IF(L637=FALSE,0,COUNTIF(A$3:A636,\">0\")+1)","v":0},4116092304,"SLN 270 FT5,5 15B","813 300,-Ft ","ABAC","Kompresszor",null,null,813300]
[{"$f":"IF(L638=FALSE,0,COUNTIF(A$3:A637,\">0\")+1)","v":0},4116092299,"SLN 270 FT5,5 YD","915 800,-Ft ","ABAC","Kompresszor",null,null,915800]
[{"$f":"IF(L639=FALSE,0,COUNTIF(A$3:A638,\">0\")+1)","v":0},4116092305,"SLN 270 FT5,5 15B YD","985 700,-Ft ","ABAC","Kompresszor",null,null,985700]
[{"$f":"IF(L640=FALSE,0,COUNTIF(A$3:A639,\">0\")+1)","v":0},4116092301,"SLN 270V FT5,5","832 300,-Ft ","ABAC","Kompresszor",null,null,832300]
[{"$f":"IF(L641=FALSE,0,COUNTIF(A$3:A640,\">0\")+1)","v":0},4116092306,"SLN 270V FT5,5 15B","866 500,-Ft ","ABAC","Kompresszor",null,null,866500]
[{"$f":"IF(L642=FALSE,0,COUNTIF(A$3:A641,\">0\")+1)","v":0},4116092302,"SLN 500 FT5,5","817 800,-Ft ","ABAC","Kompresszor",null,null,817800]
[{"$f":"IF(L643=FALSE,0,COUNTIF(A$3:A642,\">0\")+1)","v":0},4116092303,"SLN 500 FT5,5 YD","991 300,-Ft ","ABAC","Kompresszor",null,null,991300]
[{"$f":"IF(L644=FALSE,0,COUNTIF(A$3:A643,\">0\")+1)","v":0},4116092307,"SLN 270V FT7,5","941 700,-Ft ","ABAC","Kompresszor",null,null,941700]
[{"$f":"IF(L645=FALSE,0,COUNTIF(A$3:A644,\">0\")+1)","v":0},4116092308,"SLN 500 FT7,5","945 600,-Ft ","ABAC","Kompresszor",null,null,945600]
[{"$f":"IF(L646=FALSE,0,COUNTIF(A$3:A645,\">0\")+1)","v":0},4116092310,"SLN 500 FT7,5 15B","996 800,-Ft ","ABAC","Kompresszor",null,null,996800]
[{"$f":"IF(L647=FALSE,0,COUNTIF(A$3:A646,\">0\")+1)","v":0},4116092309,"SLN 500 FT7,5 YD","1 111 800,-Ft ","ABAC","Kompresszor",null,null,1111800]
[{"$f":"IF(L648=FALSE,0,COUNTIF(A$3:A647,\">0\")+1)","v":0},4116092311,"SLN 500 FT7,5 15B YD","1 162 800,-Ft ","ABAC","Kompresszor",null,null,1162800]
[{"$f":"IF(L649=FALSE,0,COUNTIF(A$3:A648,\">0\")+1)","v":0},4116000250,"PRO A49B 100 CM3","212 700,-Ft ","ABAC","Kompresszor",null,null,212700]
[{"$f":"IF(L650=FALSE,0,COUNTIF(A$3:A649,\">0\")+1)","v":0},4116000251,"PRO A49B 150 CM3","228 100,-Ft ","ABAC","Kompresszor",null,null,228100]
[{"$f":"IF(L651=FALSE,0,COUNTIF(A$3:A650,\">0\")+1)","v":0},4116000252,"PRO A49B 200 CM3","254 700,-Ft ","ABAC","Kompresszor",null,null,254700]
[{"$f":"IF(L652=FALSE,0,COUNTIF(A$3:A651,\">0\")+1)","v":0},4116000253,"PRO A49B 270 FM3","257 700,-Ft ","ABAC","Kompresszor",null,null,257700]
[{"$f":"IF(L653=FALSE,0,COUNTIF(A$3:A652,\">0\")+1)","v":0},4116000249,"PRO A49B 270 FT3","257 700,-Ft ","ABAC","Kompresszor",null,null,257700]
[{"$f":"IF(L654=FALSE,0,COUNTIF(A$3:A653,\">0\")+1)","v":0},4116000232,"PRO A49B 100 CT3","212 700,-Ft ","ABAC","Kompresszor",null,null,212700]
[{"$f":"IF(L655=FALSE,0,COUNTIF(A$3:A654,\">0\")+1)","v":0},4116000233,"PRO A49B 150 CT3","228 100,-Ft ","ABAC","Kompresszor",null,null,228100]
[{"$f":"IF(L656=FALSE,0,COUNTIF(A$3:A655,\">0\")+1)","v":0},4116000234,"PRO A49B 200 CT3","254 700,-Ft ","ABAC","Kompresszor",null,null,254700]
[{"$f":"IF(L657=FALSE,0,COUNTIF(A$3:A656,\">0\")+1)","v":0},4116000235,"PRO A49B 200 CT4","259 200,-Ft ","ABAC","Kompresszor",null,null,259200]
[{"$f":"IF(L658=FALSE,0,COUNTIF(A$3:A657,\">0\")+1)","v":0},4116000237,"PRO A49B 270 CT4","298 700,-Ft ","ABAC","Kompresszor",null,null,298700]
[{"$f":"IF(L659=FALSE,0,COUNTIF(A$3:A658,\">0\")+1)","v":0},4116000236,"PRO A49B 200 FT4","260 800,-Ft ","ABAC","Kompresszor",null,null,260800]
[{"$f":"IF(L660=FALSE,0,COUNTIF(A$3:A659,\">0\")+1)","v":0},4116000238,"PRO A49B 270 FT4","284 600,-Ft ","ABAC","Kompresszor",null,null,284600]
[{"$f":"IF(L661=FALSE,0,COUNTIF(A$3:A660,\">0\")+1)","v":0},4116000239,"PRO A49B 200 VT4","360 000,-Ft ","ABAC","Kompresszor",null,null,360000]
[{"$f":"IF(L662=FALSE,0,COUNTIF(A$3:A661,\">0\")+1)","v":0},4116000241,"PRO A49B 200 CT5,5","303 700,-Ft ","ABAC","Kompresszor",null,null,303700]
[{"$f":"IF(L663=FALSE,0,COUNTIF(A$3:A662,\">0\")+1)","v":0},4116000243,"PRO A49B 270 CT5,5","311 000,-Ft ","ABAC","Kompresszor",null,null,311000]
[{"$f":"IF(L664=FALSE,0,COUNTIF(A$3:A663,\">0\")+1)","v":0},4116000245,"PRO A49B 500 CT5,5","409 400,-Ft ","ABAC","Kompresszor",null,null,409400]
[{"$f":"IF(L665=FALSE,0,COUNTIF(A$3:A664,\">0\")+1)","v":0},4116000242,"PRO A49B 200 FT5,5","291 200,-Ft ","ABAC","Kompresszor",null,null,291200]
[{"$f":"IF(L666=FALSE,0,COUNTIF(A$3:A665,\">0\")+1)","v":0},4116000244,"PRO A49B 270 FT5,5","299 300,-Ft ","ABAC","Kompresszor",null,null,299300]
[{"$f":"IF(L667=FALSE,0,COUNTIF(A$3:A666,\">0\")+1)","v":0},4116000246,"PRO A49B 500 FT5,5","389 300,-Ft ","ABAC","Kompresszor",null,null,389300]
[{"$f":"IF(L668=FALSE,0,COUNTIF(A$3:A667,\">0\")+1)","v":0},4116000247,"PRO A49B 200 VT5,5","364 500,-Ft ","ABAC","Kompresszor",null,null,364500]
[{"$f":"IF(L669=FALSE,0,COUNTIF(A$3:A668,\">0\")+1)","v":0},4116000248,"PRO A49B 270 VT5,5","406 800,-Ft ","ABAC","Kompresszor",null,null,406800]
[{"$f":"IF(L670=FALSE,0,COUNTIF(A$3:A669,\">0\")+1)","v":0},1129740290,"START SILENT OS7P","54 200,-Ft ","ABAC","Kompresszor",null,null,54200]
[{"$f":"IF(L671=FALSE,0,COUNTIF(A$3:A670,\">0\")+1)","v":0},1129740325,"START SILENT OS10P","59 400,-Ft ","ABAC","Kompresszor",null,null,59400]
[{"$f":"IF(L672=FALSE,0,COUNTIF(A$3:A671,\">0\")+1)","v":0},1129740291,"START SILENT OS15P","57 300,-Ft ","ABAC","Kompresszor",null,null,57300]
[{"$f":"IF(L673=FALSE,0,COUNTIF(A$3:A672,\">0\")+1)","v":0},1129740292,"START SILENT OS20P","65 900,-Ft ","ABAC","Kompresszor",null,null,65900]
[{"$f":"IF(L674=FALSE,0,COUNTIF(A$3:A673,\">0\")+1)","v":0},1129740293,"SILVERSTONE OS7P","59 700,-Ft ","ABAC","Kompresszor",null,null,59700]
[{"$f":"IF(L675=FALSE,0,COUNTIF(A$3:A674,\">0\")+1)","v":0},1129740330,"SILVERSTONE OS15P","65 100,-Ft ","ABAC","Kompresszor",null,null,65100]
[{"$f":"IF(L676=FALSE,0,COUNTIF(A$3:A675,\">0\")+1)","v":0},1129740295,"SILVERSTONE OS20P",",-Ft ","ABAC","Kompresszor",null,null,0]
[{"$f":"IF(L677=FALSE,0,COUNTIF(A$3:A676,\">0\")+1)","v":0},1129740335,"HOCHENHEIM OS15P",",-Ft ","ABAC","Kompresszor",null,null,0]
[{"$f":"IF(L678=FALSE,0,COUNTIF(A$3:A677,\">0\")+1)","v":0},1129740336,"HOCHENHEIM OS20P","80 500,-Ft ","ABAC","Kompresszor",null,null,80500]
[{"$f":"IF(L679=FALSE,0,COUNTIF(A$3:A678,\">0\")+1)","v":0},1129740344,"PORTABLE ROLLCAGE OS15P",",-Ft ","ABAC","Kompresszor",null,null,0]
[{"$f":"IF(L680=FALSE,0,COUNTIF(A$3:A679,\">0\")+1)","v":0},1129740300,"PORTABLE ROLLCAGE OS20P","94 500,-Ft ","ABAC","Kompresszor",null,null,94500]
[{"$f":"IF(L681=FALSE,0,COUNTIF(A$3:A680,\">0\")+1)","v":0},1129740296,"POLE POSITION OS15P","59 700,-Ft ","ABAC","Kompresszor",null,null,59700]
[{"$f":"IF(L682=FALSE,0,COUNTIF(A$3:A681,\">0\")+1)","v":0},1129740297,"POLE POSITION  OS20P","68 300,-Ft ","ABAC","Kompresszor",null,null,68300]
[{"$f":"IF(L683=FALSE,0,COUNTIF(A$3:A682,\">0\")+1)","v":0},1129740298,"MONTECARLO OS15P","67 500,-Ft ","ABAC","Kompresszor",null,null,67500]
[{"$f":"IF(L684=FALSE,0,COUNTIF(A$3:A683,\">0\")+1)","v":0},1129740299,"MONTECARLO  OS20P","76 100,-Ft ","ABAC","Kompresszor",null,null,76100]
[{"$f":"IF(L685=FALSE,0,COUNTIF(A$3:A684,\">0\")+1)","v":0},1129740357,"ABAC XPN O15","64 700,-Ft ","ABAC","Kompresszor",null,null,64700]
[{"$f":"IF(L686=FALSE,0,COUNTIF(A$3:A685,\">0\")+1)","v":0},2236111635,"305-A29",",-Ft ","ABAC","Alkatrész"]
[{"$f":"IF(L687=FALSE,0,COUNTIF(A$3:A686,\">0\")+1)","v":0},2901325044,"310-A29","23 730,-Ft ","ABAC","Alkatrész",null,null,23730]
[{"$f":"IF(L688=FALSE,0,COUNTIF(A$3:A687,\">0\")+1)","v":0},2236112518,"325-A29","8 550,-Ft ","ABAC","Alkatrész",null,null,8550]
[{"$f":"IF(L689=FALSE,0,COUNTIF(A$3:A688,\">0\")+1)","v":0},2901325046,"330-A29","20 580,-Ft ","ABAC","Alkatrész",null,null,20580]
[{"$f":"IF(L690=FALSE,0,COUNTIF(A$3:A689,\">0\")+1)","v":0},2901325045,"335-A29","10 070,-Ft ","ABAC","Alkatrész",null,null,10070]
[{"$f":"IF(L691=FALSE,0,COUNTIF(A$3:A690,\">0\")+1)","v":0},2901325047,"340-A29","19 990,-Ft ","ABAC","Alkatrész",null,null,19990]
[{"$f":"IF(L692=FALSE,0,COUNTIF(A$3:A691,\">0\")+1)","v":0},2236112434,"345-A29",{"$f":"IF(H692=\"SP\",IF(J692>0,\"SP: \"&TEXT(J692*I$1,\"# ###,-Ft  \"),\"SP: \"&TEXT(I692*I$1,\"# ###,-Ft\")),IF(J692>0,\"*(\"&TEXT(I692*I$1,\"# ###,-\")&\") \n\"&TEXT(J692*J$1,\"# ###,-Ft\"),TEXT(I692*I$1,\"# ###,-Ft  \")))","v":"15 390,-Ft "},"ABAC","Alkatrész",null,null,15390]
[{"$f":"IF(L693=FALSE,0,COUNTIF(A$3:A692,\">0\")+1)","v":0},2901325048,"350-A29","12 970,-Ft ","ABAC","Alkatrész",null,null,12970]
[{"$f":"IF(L694=FALSE,0,COUNTIF(A$3:A693,\">0\")+1)","v":0},2236111619,"355-A29","9 940,-Ft ","ABAC","Alkatrész",null,null,9940]
[{"$f":"IF(L695=FALSE,0,COUNTIF(A$3:A694,\">0\")+1)","v":0},2901325049,"360-A29","14 600,-Ft ","ABAC","Alkatrész",null,null,14600]
[{"$f":"IF(L696=FALSE,0,COUNTIF(A$3:A695,\">0\")+1)","v":0},2236112437,"365-A29","4 610,-Ft ","ABAC","Alkatrész",null,null,4610]
[{"$f":"IF(L697=FALSE,0,COUNTIF(A$3:A696,\">0\")+1)","v":0},1630020700,"375-A29","3 850,-Ft ","ABAC","Alkatrész",null,null,3850]
[{"$f":"IF(L698=FALSE,0,COUNTIF(A$3:A697,\">0\")+1)","v":0},1630020700,"KM1-A29","3 850,-Ft ","ABAC","Alkatrész",null,null,3850]
[{"$f":"IF(L699=FALSE,0,COUNTIF(A$3:A698,\">0\")+1)","v":0},8973037865,"KM2-A29",",-Ft ","ABAC","Alkatrész"]
[{"$f":"IF(L700=FALSE,0,COUNTIF(A$3:A699,\">0\")+1)","v":0},8973037657,"PK1-A29","13 790,-Ft ","ABAC","Alkatrész",null,null,13790]
[{"$f":"IF(L701=FALSE,0,COUNTIF(A$3:A700,\">0\")+1)","v":0},8973037658,"PK2-A29",",-Ft ","ABAC","Alkatrész"]
[{"$f":"IF(L702=FALSE,0,COUNTIF(A$3:A701,\">0\")+1)","v":0},6229024000,"315-B2800","15 560,-Ft ","ABAC","Alkatrész",null,null,15560]
[{"$f":"IF(L703=FALSE,0,COUNTIF(A$3:A702,\">0\")+1)","v":0},6229020400,"330-B2800","15 070,-Ft ","ABAC","Alkatrész",null,null,15070]
[{"$f":"IF(L704=FALSE,0,COUNTIF(A$3:A703,\">0\")+1)","v":0},8973037620,"335-B2800","18 690,-Ft ","ABAC","Alkatrész",null,null,18690]
[{"$f":"IF(L705=FALSE,0,COUNTIF(A$3:A704,\">0\")+1)","v":0},2901324933,"340-B2800","27 000,-Ft ","ABAC","Alkatrész",null,null,27000]
[{"$f":"IF(L706=FALSE,0,COUNTIF(A$3:A705,\">0\")+1)","v":0},6229023600,"350-B2800","5 710,-Ft ","ABAC","Alkatrész",null,null,5710]
[{"$f":"IF(L707=FALSE,0,COUNTIF(A$3:A706,\">0\")+1)","v":0},6229020900,"350-B2800","22 670,-Ft ","ABAC","Alkatrész",null,null,22670]
[{"$f":"IF(L708=FALSE,0,COUNTIF(A$3:A707,\">0\")+1)","v":0},6229023400,"360-B2800","11 820,-Ft ","ABAC","Alkatrész",null,null,11820]
[{"$f":"IF(L709=FALSE,0,COUNTIF(A$3:A708,\">0\")+1)","v":0},6229021000,"PK1-B2800","6 230,-Ft ","ABAC","Alkatrész",null,null,6230]
[{"$f":"IF(L710=FALSE,0,COUNTIF(A$3:A709,\">0\")+1)","v":0},8973037621,"PK2-B2800",",-Ft ","ABAC","Alkatrész"]
[{"$f":"IF(L711=FALSE,0,COUNTIF(A$3:A710,\">0\")+1)","v":0},6229024000,"315-B3800","15 560,-Ft ","ABAC","Alkatrész",null,null,15560]
[{"$f":"IF(L712=FALSE,0,COUNTIF(A$3:A711,\">0\")+1)","v":0},6229020400,"330-B3800","15 070,-Ft ","ABAC","Alkatrész",null,null,15070]
[{"$f":"IF(L713=FALSE,0,COUNTIF(A$3:A712,\">0\")+1)","v":0},8973037621,"335-B3800",",-Ft ","ABAC","Alkatrész"]
[{"$f":"IF(L714=FALSE,0,COUNTIF(A$3:A713,\">0\")+1)","v":0},2901324900,"340-B3800","29 280,-Ft ","ABAC","Alkatrész",null,null,29280]
[{"$f":"IF(L715=FALSE,0,COUNTIF(A$3:A714,\">0\")+1)","v":0},6229023600,"350-B3800","5 710,-Ft ","ABAC","Alkatrész",null,null,5710]
[{"$f":"IF(L716=FALSE,0,COUNTIF(A$3:A715,\">0\")+1)","v":0},6229020900,"360-B3800","22 670,-Ft ","ABAC","Alkatrész",null,null,22670]
[{"$f":"IF(L717=FALSE,0,COUNTIF(A$3:A716,\">0\")+1)","v":0},6229021000,"PK1-B3800","6 230,-Ft ","ABAC","Alkatrész",null,null,6230]
[{"$f":"IF(L718=FALSE,0,COUNTIF(A$3:A717,\">0\")+1)","v":0},8973037620,"PK2-B3800","18 690,-Ft ","ABAC","Alkatrész",null,null,18690]
[{"$f":"IF(L719=FALSE,0,COUNTIF(A$3:A718,\">0\")+1)","v":0},2236111635,"305-A39",",-Ft ","ABAC","Alkatrész"]
[{"$f":"IF(L720=FALSE,0,COUNTIF(A$3:A719,\">0\")+1)","v":0},2901325044,"310-A39","23 730,-Ft ","ABAC","Alkatrész",null,null,23730]
[{"$f":"IF(L721=FALSE,0,COUNTIF(A$3:A720,\">0\")+1)","v":0},2236112518,"325-A39","8 550,-Ft ","ABAC","Alkatrész",null,null,8550]
[{"$f":"IF(L722=FALSE,0,COUNTIF(A$3:A721,\">0\")+1)","v":0},2901325046,"330-A39","20 580,-Ft ","ABAC","Alkatrész",null,null,20580]
[{"$f":"IF(L723=FALSE,0,COUNTIF(A$3:A722,\">0\")+1)","v":0},2901325045,"335-A39","10 070,-Ft ","ABAC","Alkatrész",null,null,10070]
[{"$f":"IF(L724=FALSE,0,COUNTIF(A$3:A723,\">0\")+1)","v":0},8973037864,"365-A39","4 170,-Ft ","ABAC","Alkatrész",null,null,4170]
[{"$f":"IF(L725=FALSE,0,COUNTIF(A$3:A724,\">0\")+1)","v":0},2901325047,"340-A39","19 990,-Ft ","ABAC","Alkatrész",null,null,19990]
[{"$f":"IF(L726=FALSE,0,COUNTIF(A$3:A725,\">0\")+1)","v":0},2236112435,"345-A39","16 880,-Ft ","ABAC","Alkatrész",null,null,16880]
[{"$f":"IF(L727=FALSE,0,COUNTIF(A$3:A726,\">0\")+1)","v":0},2901325050,"350-A39","22 610,-Ft ","ABAC","Alkatrész",null,null,22610]
[{"$f":"IF(L728=FALSE,0,COUNTIF(A$3:A727,\">0\")+1)","v":0},2236111620,"355-A39","10 370,-Ft ","ABAC","Alkatrész",null,null,10370]
[{"$f":"IF(L729=FALSE,0,COUNTIF(A$3:A728,\">0\")+1)","v":0},2901325049,"360-A39","14 600,-Ft ","ABAC","Alkatrész",null,null,14600]
[{"$f":"IF(L730=FALSE,0,COUNTIF(A$3:A729,\">0\")+1)","v":0},2236112438,"365-A39","5 600,-Ft ","ABAC","Alkatrész",null,null,5600]
[{"$f":"IF(L731=FALSE,0,COUNTIF(A$3:A730,\">0\")+1)","v":0},1630020700,"375-A39","3 850,-Ft ","ABAC","Alkatrész",null,null,3850]
[{"$f":"IF(L732=FALSE,0,COUNTIF(A$3:A731,\">0\")+1)","v":0},1630020700,"KM1-A39","3 850,-Ft ","ABAC","Alkatrész",null,null,3850]
[{"$f":"IF(L733=FALSE,0,COUNTIF(A$3:A732,\">0\")+1)","v":0},8973037865,"KM2-A39",",-Ft ","ABAC","Alkatrész"]
[{"$f":"IF(L734=FALSE,0,COUNTIF(A$3:A733,\">0\")+1)","v":0},8973037657,"PK1-A39","13 790,-Ft ","ABAC","Alkatrész",null,null,13790]
[{"$f":"IF(L735=FALSE,0,COUNTIF(A$3:A734,\">0\")+1)","v":0},8973037658,"PK2-A39",",-Ft ","ABAC","Alkatrész"]
[{"$f":"IF(L736=FALSE,0,COUNTIF(A$3:A735,\">0\")+1)","v":0},2901324960,"310-B4900","23 480,-Ft ","ABAC","Alkatrész",null,null,23480]
[{"$f":"IF(L737=FALSE,0,COUNTIF(A$3:A736,\">0\")+1)","v":0},8973035118,"320-B4900","16 460,-Ft ","ABAC","Alkatrész",null,null,16460]
[{"$f":"IF(L738=FALSE,0,COUNTIF(A$3:A737,\">0\")+1)","v":0},2901324963,"330-B4900",",-Ft ","ABAC","Alkatrész"]
[{"$f":"IF(L739=FALSE,0,COUNTIF(A$3:A738,\">0\")+1)","v":0},2901324961,"335-B4900","30 210,-Ft ","ABAC","Alkatrész",null,null,30210]
[{"$f":"IF(L740=FALSE,0,COUNTIF(A$3:A739,\">0\")+1)","v":0},6229017300,"340-B4900","39 300,-Ft ","ABAC","Alkatrész",null,null,39300]
[{"$f":"IF(L741=FALSE,0,COUNTIF(A$3:A740,\">0\")+1)","v":0},2901324962,"350-B4900","21 200,-Ft ","ABAC","Alkatrész",null,null,21200]
[{"$f":"IF(L742=FALSE,0,COUNTIF(A$3:A741,\">0\")+1)","v":0},6229017600,"360-B4900","19 730,-Ft ","ABAC","Alkatrész",null,null,19730]
[{"$f":"IF(L743=FALSE,0,COUNTIF(A$3:A742,\">0\")+1)","v":0},2901324950,"370-B4900","6 790,-Ft ","ABAC","Alkatrész",null,null,6790]
[{"$f":"IF(L744=FALSE,0,COUNTIF(A$3:A743,\">0\")+1)","v":0},8973035059,"380-B4900","1 570,-Ft ","ABAC","Alkatrész",null,null,1570]
[{"$f":"IF(L745=FALSE,0,COUNTIF(A$3:A744,\">0\")+1)","v":0},8973037624,"PK1-B4900","26 870,-Ft ","ABAC","Alkatrész",null,null,26870]
[{"$f":"IF(L746=FALSE,0,COUNTIF(A$3:A745,\">0\")+1)","v":0},8973037625,"PK2-B4900",",-Ft ","ABAC","Alkatrész"]
[{"$f":"IF(L747=FALSE,0,COUNTIF(A$3:A746,\">0\")+1)","v":0},2901324964,"310-B5900","23 500,-Ft ","ABAC","Alkatrész",null,null,23500]
[{"$f":"IF(L748=FALSE,0,COUNTIF(A$3:A747,\">0\")+1)","v":0},8973037264,"320-B5900","8 460,-Ft ","ABAC","Alkatrész",null,null,8460]
[{"$f":"IF(L749=FALSE,0,COUNTIF(A$3:A748,\">0\")+1)","v":0},6229020200,"330-B5900","2 230,-Ft ","ABAC","Alkatrész",null,null,2230]
[{"$f":"IF(L750=FALSE,0,COUNTIF(A$3:A749,\">0\")+1)","v":0},2901324965,"335-B5900","28 710,-Ft ","ABAC","Alkatrész",null,null,28710]
[{"$f":"IF(L751=FALSE,0,COUNTIF(A$3:A750,\">0\")+1)","v":0},6229026900,"340-B5900","38 520,-Ft ","ABAC","Alkatrész",null,null,38520]
[{"$f":"IF(L752=FALSE,0,COUNTIF(A$3:A751,\">0\")+1)","v":0},2901324966,"350-B5900","27 770,-Ft ","ABAC","Alkatrész",null,null,27770]
[{"$f":"IF(L753=FALSE,0,COUNTIF(A$3:A752,\">0\")+1)","v":0},6229020100,"360-B5900",",-Ft ","ABAC","Alkatrész"]
[{"$f":"IF(L754=FALSE,0,COUNTIF(A$3:A753,\">0\")+1)","v":0},2901324951,"370-B5900",",-Ft ","ABAC","Alkatrész"]
[{"$f":"IF(L755=FALSE,0,COUNTIF(A$3:A754,\">0\")+1)","v":0},8973037628,"PK1-B5900","52 310,-Ft ","ABAC","Alkatrész",null,null,52310]
[{"$f":"IF(L756=FALSE,0,COUNTIF(A$3:A755,\">0\")+1)","v":0},8973037629,"PK2-B5900",{"$f":"IF(H756=\"SP\",IF(J756>0,\"SP: \"&TEXT(J756*I$1,\"# ###,-Ft  \"),\"SP: \"&TEXT(I756*I$1,\"# ###,-Ft\")),IF(J756>0,\"*(\"&TEXT(I756*I$1,\"# ###,-\")&\") \n\"&TEXT(J756*J$1,\"# ###,-Ft\"),TEXT(I756*I$1,\"# ###,-Ft  \")))","v":",-Ft "},"ABAC","Alkatrész"]
[{"$f":"IF(L757=FALSE,0,COUNTIF(A$3:A756,\">0\")+1)","v":0},8973037630,"PK3-B5900","42 890,-Ft ","ABAC","Alkatrész",null,null,42890]
[{"$f":"IF(L758=FALSE,0,COUNTIF(A$3:A757,\">0\")+1)","v":0},8973037631,"PK4-B5900",",-Ft ","ABAC","Alkatrész"]
[{"$f":"IF(L759=FALSE,0,COUNTIF(A$3:A758,\">0\")+1)","v":0},2901324967,"310-B6000","34 090,-Ft ","ABAC","Alkatrész",null,null,34090]
[{"$f":"IF(L760=FALSE,0,COUNTIF(A$3:A759,\">0\")+1)","v":0},2901324968,"320-B6000","33 090,-Ft ","ABAC","Alkatrész",null,null,33090]
[{"$f":"IF(L761=FALSE,0,COUNTIF(A$3:A760,\">0\")+1)","v":0},6229027600,"330-B6000","35 640,-Ft ","ABAC","Alkatrész",null,null,35640]
[{"$f":"IF(L762=FALSE,0,COUNTIF(A$3:A761,\">0\")+1)","v":0},8973035123,"335-B6000","7 110,-Ft ","ABAC","Alkatrész",null,null,7110]
[{"$f":"IF(L763=FALSE,0,COUNTIF(A$3:A762,\">0\")+1)","v":0},2901324966,"340-B6000","27 770,-Ft ","ABAC","Alkatrész",null,null,27770]
[{"$f":"IF(L764=FALSE,0,COUNTIF(A$3:A763,\">0\")+1)","v":0},6229020100,"350-B6000",",-Ft ","ABAC","Alkatrész"]
[{"$f":"IF(L765=FALSE,0,COUNTIF(A$3:A764,\">0\")+1)","v":0},2901324952,"360-B6000","12 020,-Ft ","ABAC","Alkatrész",null,null,12020]
[{"$f":"IF(L766=FALSE,0,COUNTIF(A$3:A765,\">0\")+1)","v":0},6229020200,"370-B6000","2 230,-Ft ","ABAC","Alkatrész",null,null,2230]
[{"$f":"IF(L767=FALSE,0,COUNTIF(A$3:A766,\">0\")+1)","v":0},8973037632,"PK1-B6000","75 170,-Ft ","ABAC","Alkatrész",null,null,75170]
[{"$f":"IF(L768=FALSE,0,COUNTIF(A$3:A767,\">0\")+1)","v":0},8973037633,"PK2-B6000",",-Ft ","ABAC","Alkatrész"]
[{"$f":"IF(L769=FALSE,0,COUNTIF(A$3:A768,\">0\")+1)","v":0},8973037634,"PK3-B6000","68 020,-Ft ","ABAC","Alkatrész",null,null,68020]
[{"$f":"IF(L770=FALSE,0,COUNTIF(A$3:A769,\">0\")+1)","v":0},8973037635,"PK4-B6000",",-Ft ","ABAC","Alkatrész"]
[{"$f":"IF(L771=FALSE,0,COUNTIF(A$3:A770,\">0\")+1)","v":0},2901324969,"310-B7000","39 130,-Ft ","ABAC","Alkatrész",null,null,39130]
[{"$f":"IF(L772=FALSE,0,COUNTIF(A$3:A771,\">0\")+1)","v":0},8973035130,"320-B7000","13 110,-Ft ","ABAC","Alkatrész",null,null,13110]
[{"$f":"IF(L773=FALSE,0,COUNTIF(A$3:A772,\">0\")+1)","v":0},6229020200,"330-B7000","2 230,-Ft ","ABAC","Alkatrész",null,null,2230]
[{"$f":"IF(L774=FALSE,0,COUNTIF(A$3:A773,\">0\")+1)","v":0},2901324970,"335-B7000","42 570,-Ft ","ABAC","Alkatrész",null,null,42570]
[{"$f":"IF(L775=FALSE,0,COUNTIF(A$3:A774,\">0\")+1)","v":0},6229028200,"340-B7000","43 720,-Ft ","ABAC","Alkatrész",null,null,43720]
[{"$f":"IF(L776=FALSE,0,COUNTIF(A$3:A775,\">0\")+1)","v":0},2901324966,"350-B7000","27 770,-Ft ","ABAC","Alkatrész",null,null,27770]
[{"$f":"IF(L777=FALSE,0,COUNTIF(A$3:A776,\">0\")+1)","v":0},6229020100,"360-B7000",",-Ft ","ABAC","Alkatrész"]
[{"$f":"IF(L778=FALSE,0,COUNTIF(A$3:A777,\">0\")+1)","v":0},2901324953,"370-B7000","12 040,-Ft ","ABAC","Alkatrész",null,null,12040]
[{"$f":"IF(L779=FALSE,0,COUNTIF(A$3:A778,\">0\")+1)","v":0},8973037636,"PK1-B7000","91 140,-Ft ","ABAC","Alkatrész",null,null,91140]
[{"$f":"IF(L780=FALSE,0,COUNTIF(A$3:A779,\">0\")+1)","v":0},8973037637,"PK2-B7000",",-Ft ","ABAC","Alkatrész"]
[{"$f":"IF(L781=FALSE,0,COUNTIF(A$3:A780,\">0\")+1)","v":0},4116002086,"ENGINEAIR 4/100 PETROL",{"$f":"IF(H781=\"SP\",IF(J781>0,\"SP: \"&TEXT(J781/340*I$1,\"# ###,-Ft  \"),\"SP: \"&TEXT(I781/340*I$1,\"# ###,-€\")),IF(J781>0,\"*(\"&TEXT(I781/340*I$1,\"# ###,-\")&\") \n\"&TEXT(J781/340*J$1,\"# ###,-€\"),TEXT(I781/340*I$1,\"# ###,-€ \")))","v":"1 210,-€ "},"EnginAir",null,1210,null,{"$f":"G781*340","v":411400}]
[{"$f":"IF(L782=FALSE,0,COUNTIF(A$3:A781,\">0\")+1)","v":0},4116002087,"ENGINEAIR 5/50 PETROL","1 320,-€ ","EnginAir",null,1320,null,448800]
[{"$f":"IF(L783=FALSE,0,COUNTIF(A$3:A782,\">0\")+1)","v":0},4116002088,"ENGINEAIR 5/100 PETROL","1 420,-€ ","EnginAir",null,1420,null,482800]
[{"$f":"IF(L784=FALSE,0,COUNTIF(A$3:A783,\">0\")+1)","v":0},4116002089,"ENGINEAIR 5/200 PETROL","1 710,-€ ","EnginAir",null,1710,null,581400]
[{"$f":"IF(L785=FALSE,0,COUNTIF(A$3:A784,\">0\")+1)","v":0},4116002090,"ENGINEAIR 5/11+11 PETROL","1 480,-€ ","EnginAir",null,1480,null,503200]
[{"$f":"IF(L786=FALSE,0,COUNTIF(A$3:A785,\">0\")+1)","v":0},4116002091,"ENGINEAIR 5/11+11R PETROL","1 600,-€ ","EnginAir",null,1600,null,544000]
[{"$f":"IF(L787=FALSE,0,COUNTIF(A$3:A786,\">0\")+1)","v":0},4116022690,"ENGINEAIR 7/25+25R PETROL","2 880,-€ ","EnginAir",null,2880,null,979200]
[{"$f":"IF(L788=FALSE,0,COUNTIF(A$3:A787,\">0\")+1)","v":0},4116022691,"ENGINEAIR 7/270 PETROL","3 400,-€ ","EnginAir",null,3400,null,1156000]
[{"$f":"IF(L789=FALSE,0,COUNTIF(A$3:A788,\">0\")+1)","v":0},4116022692,"ENGINEAIR 11/270 PETROL","3 810,-€ ","EnginAir",null,3810,null,1295400]
[{"$f":"IF(L790=FALSE,0,COUNTIF(A$3:A789,\">0\")+1)","v":0},4116022693,"ENGINEAIR 8/270 DIESEL","4 530,-€ ","EnginAir",null,4530,null,1540200]
[{"$f":"IF(L791=FALSE,0,COUNTIF(A$3:A790,\">0\")+1)","v":0},4116022694,"ENGINEAIR 11/270 DIESEL","5 870,-€ ","EnginAir",null,5870,null,1995800]
[{"$f":"IF(L792=FALSE,0,COUNTIF(A$3:A791,\">0\")+1)","v":0},4116022695,"ENGINEAIR 8/270 DIESEL 2.2KVA","5 770,-€ ","EnginAir",null,5770,null,1961800]
[{"$f":"IF(L793=FALSE,0,COUNTIF(A$3:A792,\">0\")+1)","v":0},4116022696,"ENGINEAIR 11/270 DIESEL 2.2KVA","6 590,-€ ","EnginAir",null,6590,null,2240600]
[{"$f":"IF(L794=FALSE,0,COUNTIF(A$3:A793,\">0\")+1)","v":0},4116002092,"ENGINEAIR 4 PETROL","1 140,-€ ","EnginAir",null,1140,null,387600]
[{"$f":"IF(L795=FALSE,0,COUNTIF(A$3:A794,\">0\")+1)","v":0},4116002093,"ENGINEAIR 5 PETROL","1 260,-€ ","EnginAir",null,1260,null,428400]
[{"$f":"IF(L796=FALSE,0,COUNTIF(A$3:A795,\">0\")+1)","v":0},4116002073,"ENGINEAIR 7 PETROL","2 470,-€ ","EnginAir",null,2470,null,839800]
[{"$f":"IF(L797=FALSE,0,COUNTIF(A$3:A796,\">0\")+1)","v":0},4116002074,"ENGINEAIR 11 PETROL","2 680,-€ ","EnginAir",null,2680,null,911200]
[{"$f":"IF(L798=FALSE,0,COUNTIF(A$3:A797,\">0\")+1)","v":0},4116002082,"ENGINEAIR 12 PETROL","2 880,-€ ","EnginAir",null,2880,null,979200]
[{"$f":"IF(L799=FALSE,0,COUNTIF(A$3:A798,\">0\")+1)","v":0},4116002075,"ENGINEAIR 8 DIESEL","4 120,-€ ","EnginAir",null,4120,null,1400800]
[{"$f":"IF(L800=FALSE,0,COUNTIF(A$3:A799,\">0\")+1)","v":0},4116002076,"ENGINEAIR 11 DIESEL","4 940,-€ ","EnginAir",null,4940,null,1679600]
[{"$f":"IF(L801=FALSE,0,COUNTIF(A$3:A800,\">0\")+1)","v":0},4116002083,"ENGINEAIR 12 DIESEL","5 150,-€ ","EnginAir",null,5150,null,1751000]
[{"$f":"IF(L802=FALSE,0,COUNTIF(A$3:A801,\">0\")+1)","v":0},4116002077,"BI ENGINEAIR 8 DIESEL 2.2KVA","4 840,-€ ","EnginAir",null,4840,null,1645600]
[{"$f":"IF(L803=FALSE,0,COUNTIF(A$3:A802,\">0\")+1)","v":0},4116002078,"BI ENGINEAIR 11 DIESEL 2.2KVA","5 770,-€ ","EnginAir",null,5770,null,1961800]
[{"$f":"IF(L804=FALSE,0,COUNTIF(A$3:A803,\">0\")+1)","v":0},4116002084,"BI ENGINEAIR 12 DIESEL 3KVA","6 080,-€ ","EnginAir",null,6080,null,2067200]
[{"$f":"IF(L805=FALSE,0,COUNTIF(A$3:A804,\">0\")+1)","v":0},4102003620,"COOL  21 (C0) 230/50 ALUP","420,-€ ",null,null,420,null,142800]
[{"$f":"IF(L806=FALSE,0,COUNTIF(A$3:A805,\">0\")+1)","v":0},4102003621,"COOL  36 (C1) 230/50 ALUP","520,-€ ",null,null,520,null,176800]
[{"$f":"IF(L807=FALSE,0,COUNTIF(A$3:A806,\">0\")+1)","v":0},4102003622,"COOL  51 (C2) 230/50 ALUP","580,-€ ",null,null,580,null,197200]
[{"$f":"IF(L808=FALSE,0,COUNTIF(A$3:A807,\">0\")+1)","v":0},4102003623,"COOL  72 (C3) 230/50 ALUP","620,-€ ",null,null,620,null,210800]
[{"$f":"IF(L809=FALSE,0,COUNTIF(A$3:A808,\">0\")+1)","v":0},4102003624,"COOL 110 (C4) 230/50 ALUP","690,-€ ",null,null,690,null,234600]
[{"$f":"IF(L810=FALSE,0,COUNTIF(A$3:A809,\">0\")+1)","v":0},4102003625,"COOL 129 (C5) 230/50 ALUP","730,-€ ",null,null,730,null,248200]
[{"$f":"IF(L811=FALSE,0,COUNTIF(A$3:A810,\">0\")+1)","v":0},4102001847,"COOL  180 (C6) 230/50 ALUP","910,-€ ",null,null,910,null,309400]
[{"$f":"IF(L812=FALSE,0,COUNTIF(A$3:A811,\">0\")+1)","v":0},4102002090,"COOL 216 (C7) 230/50 ALUP","1 040,-€ ",null,null,1040,null,353600]
[{"$f":"IF(L813=FALSE,0,COUNTIF(A$3:A812,\">0\")+1)","v":0},4102002091,"COOL 246 (C7,5) 230/50 ALUP",{"$f":"IF(H813=\"SP\",IF(J813>0,\"SP: \"&TEXT(J813/340*I$1,\"# ###,-Ft  \"),\"SP: \"&TEXT(I813/340*I$1,\"# ###,-€\")),IF(J813>0,\"*(\"&TEXT(I813/340*I$1,\"# ###,-\")&\") \n\"&TEXT(J813/340*J$1,\"# ###,-€\"),TEXT(I813/340*I$1,\"# ###,-€ \")))","v":"1 190,-€ "},null,null,1190,null,404600]
[{"$f":"IF(L814=FALSE,0,COUNTIF(A$3:A813,\">0\")+1)","v":0},4102002092,"COOL 312 (C8) 230/50 ALUP","1 350,-€ ",null,null,1350,null,459000]
[{"$f":"IF(L815=FALSE,0,COUNTIF(A$3:A814,\">0\")+1)","v":0},4102002093,"COOL 390 (C9) 230/50 ALUP","1 540,-€ ",null,null,1540,null,523600]
[{"$f":"IF(L816=FALSE,0,COUNTIF(A$3:A815,\">0\")+1)","v":0},4102002094,"COOL 462 (C10) 230/50 ALUP","1 700,-€ ",null,null,1700,null,578000]
[{"$f":"IF(L817=FALSE,0,COUNTIF(A$3:A816,\">0\")+1)","v":0},4102000792,"ADQ 21 (A0) 230/50 ALUP","500,-€ ",null,null,500,null,170000]
[{"$f":"IF(L818=FALSE,0,COUNTIF(A$3:A817,\">0\")+1)","v":0},4102000793,"ADQ 36 (A1) 230/50 ALUP","600,-€ ",null,null,600,null,204000]
[{"$f":"IF(L819=FALSE,0,COUNTIF(A$3:A818,\">0\")+1)","v":0},4102000794,"ADQ 51 (A2) 230/50 ALUP","670,-€ ",null,null,670,null,227800]
[{"$f":"IF(L820=FALSE,0,COUNTIF(A$3:A819,\">0\")+1)","v":0},4102000795,"ADQ 72 (A3) 230/50 ALUP","720,-€ ",null,null,720,null,244800]
[{"$f":"IF(L821=FALSE,0,COUNTIF(A$3:A820,\">0\")+1)","v":0},4102000796,"ADQ 110 (A4) 230/50 ALUP","800,-€ ",null,null,800,null,272000]
[{"$f":"IF(L822=FALSE,0,COUNTIF(A$3:A821,\">0\")+1)","v":0},4102003314,"ADQ 141 (A5) 230/50 ALUP","850,-€ ",null,null,850,null,289000]
[{"$f":"IF(L823=FALSE,0,COUNTIF(A$3:A822,\">0\")+1)","v":0},4102003315,"ADQ 180 (A6) 230/50 ALUP","1 070,-€ ",null,null,1070,null,363800]
[{"$f":"IF(L824=FALSE,0,COUNTIF(A$3:A823,\">0\")+1)","v":0},4102002728,"ADQ 216 (A7) 230/50 ALUP","1 210,-€ ",null,null,1210,null,411400]
[{"$f":"IF(L825=FALSE,0,COUNTIF(A$3:A824,\">0\")+1)","v":0},4102002729,"ADQ 246 (A7,5) 230/50 ALUP","1 380,-€ ",null,null,1380,null,469200]
[{"$f":"IF(L826=FALSE,0,COUNTIF(A$3:A825,\">0\")+1)","v":0},4102002730,"ADQ 312 (A8) 230/50 ALUP","1 570,-€ ",null,null,1570,null,533800]
[{"$f":"IF(L827=FALSE,0,COUNTIF(A$3:A826,\">0\")+1)","v":0},4102002731,"ADQ 390 (A9) 230/50 ALUP","1 800,-€ ",null,null,1800,null,612000]
[{"$f":"IF(L828=FALSE,0,COUNTIF(A$3:A827,\">0\")+1)","v":0},4102002732,"ADQ 462 (A10) 230/50 ALUP","2 000,-€ ",null,null,2000,null,680000]
[{"$f":"IF(L829=FALSE,0,COUNTIF(A$3:A828,\">0\")+1)","v":0},4102003802,"ADQ 600 (A11) 400/3/50 ALUP","2 800,-€ ",null,null,2800,null,952000]
[{"$f":"IF(L830=FALSE,0,COUNTIF(A$3:A829,\">0\")+1)","v":0},4102003803,"ADQ 720 (A12) 400/3/50 ALUP","3 300,-€ ",null,null,3300,null,1122000]
[{"$f":"IF(L831=FALSE,0,COUNTIF(A$3:A830,\">0\")+1)","v":0},4102003804,"ADQ 900 (A13) 400/3/50 ALUP","3 800,-€ ",null,null,3800,null,1292000]
[{"$f":"IF(L832=FALSE,0,COUNTIF(A$3:A831,\">0\")+1)","v":0},4102003805,"ADQ 1080 (A14) 400/3/50 ALUP","4 700,-€ ",null,null,4700,null,1598000]
[{"$f":"IF(L833=FALSE,0,COUNTIF(A$3:A832,\">0\")+1)","v":0},4102003082,"ADQ 1440 (A15) 400/3/50 ALUP","6 200,-€ ",null,null,6200,null,2108000]
[{"$f":"IF(L834=FALSE,0,COUNTIF(A$3:A833,\">0\")+1)","v":0},4102003083,"ADQ 1800 (A16) 400/3/50 ALUP","7 200,-€ ",null,null,7200,null,2448000]
[{"$f":"IF(L835=FALSE,0,COUNTIF(A$3:A834,\">0\")+1)","v":0},4102003084,"ADQ 2100 (A17) 400/3/50 ALUP","8 500,-€ ",null,null,8500,null,2890000]
[{"$f":"IF(L836=FALSE,0,COUNTIF(A$3:A835,\">0\")+1)","v":0},4102002980,"ADQ 2700 (A17,5) 400/3/50 ALUP","10 800,-€ ",null,null,10800,null,3672000]
[{"$f":"IF(L837=FALSE,0,COUNTIF(A$3:A836,\">0\")+1)","v":0},4102002981,"ADQ 3000 (A18) 400/3/50 ALUP","11 900,-€ ",null,null,11900,null,4046000]
[{"$f":"IF(L838=FALSE,0,COUNTIF(A$3:A837,\">0\")+1)","v":0},4102002982,"ADQ 4200 (A19) 400/3/50 ALUP","14 300,-€ ",null,null,14300,null,4862000]
[{"$f":"IF(L839=FALSE,0,COUNTIF(A$3:A838,\">0\")+1)","v":0},4102002983,"ADQ 5040 (A20) 400/3/50 ALUP","16 800,-€ ",null,null,16800,null,5712000]

{"sheet":"Megrendelő","index":1,"n_rows":60,"n_cols":32,"rows_kept":60,"cut":false,"hidden":false,"merged":[[40,3,40,7],[42,0,42,1],[42,3,42,7],[38,0,38,1],[38,3,38,7],[39,0,39,1],[39,3,39,7],[1,2,1,6],[3,0,3,1],[3,2,3,6],[4,2,4,6],[11,32,13,32],[6,0,6,1],[7,0,7,1],[5,0,5,1],[4,0,4,1],[5,2,5,6]]}
[null,null,null,null,null,null,null,null,null,null,null,null,null,null,null,null,null,null,null,null,null,null,null,null,null,null,null,null,null,"Verzió:",null,"2020-02-01"]
[null,null,"MEGRENDELŐ"]
[]
["Cég neve:"]
["Számlázási cím:",null,null,null,null,null,null,"Adószám:"]
["Szállítási cím:"]
["Megrendelő neve:",null,null,"Fizetési mód:",null,null,1,"Pénznem:",1]
["Telefon:",null,null,"Kedvezmény:",null,null,0,"Szállítás:",1]
[null,null,null,"Árfolyam:",{"$f":"F9-3","v":1},4,340,"HUF/EU",{"$f":"ROUND(G9/5,0)*5","v":340}]
[]
[null,"Cikkszám","Megnevezés","Mennyiség","Kedvez- mény","Súly","Nettó listaár",{"$f":"\"Nettó kedvezményes egységár \"&IF($I$7=1,\"HUF\",\"EUR\")","v":"Nettó kedvezményes egységár HUF"},{"$f":"\"Összesen \"&IF($I$7=1,\"HUF\",\"EUR\")","v":"Összesen HUF"},null,null,"MEGRENDELŐ"]
[1,{"$f":"IFERROR(IF(ST!C3>0,ST!C3,\"\"),\"\")","v":""},{"$f":"IFERROR(IF(ST!D3>0,ST!D3,\"\"),\"\")","v":""},null,{"$f":"IFERROR(IF(ISNUMBER(G12),IF(AND(0.15<G$8,0.21>G$8),IF(ST!G3>0,0.15,G$8),IF(G$8>0.2,G$8-ST!G3,G$8)),\"\"),\"\")","v":""},{"$f":"IFERROR(ST!H3*D12,\"\")","v":""},{"$f":"IFERROR(IF(AND(E$8=\"ws\",ST!L3>0),ST!L3,IF(ST!K3>0,ST!K3,IF(ST!J3>0,ST!J3,\"\"))),\"\")","v":""},{"$f":"IFERROR(ROUND(IF(G12>0,IF(I$7>1,(1-E12)*G12/340,(1-E12)*G12/340*I$9),\"\"),E$9),\"\")","v":""},{"$f":"IFERROR(H12*D12,\"\")","v":""},null,null,"TARTALOM"]
[2,{"$f":"IFERROR(IF(ST!C4>0,ST!C4,\"\"),\"\")","v":""},{"$f":"IFERROR(IF(ST!D4>0,ST!D4,\"\"),\"\")","v":""},null,{"$f":"IFERROR(IF(ISNUMBER(G13),IF(AND(0.15<G$8,0.21>G$8),IF(ST!G4>0,0.15,G$8),IF(G$8>0.2,G$8-ST!G4,G$8)),\"\"),\"\")","v":""},{"$f":"IFERROR(ST!H4*D13,\"\")","v":""},{"$f":"IFERROR(IF(AND(E$8=\"ws\",ST!L4>0),ST!L4,IF(ST!K4>0,ST!K4,IF(ST!J4>0,ST!J4,\"\"))),\"\")","v":""},{"$f":"IFERROR(ROUND(IF(G13>0,IF(I$7>1,(1-E13)*G13/340,(1-E13)*G13/340*I$9),\"\"),E$9),\"\")","v":""},{"$f":"IFERROR(H13*D13,\"\")","v":""},null,null,"Árlista"]
[3,{"$f":"IFERROR(IF(ST!C5>0,ST!C5,\"\"),\"\")","v":""},{"$f":"IFERROR(IF(ST!D5>0,ST!D5,\"\"),\"\")","v":""},null,{"$f":"IFERROR(IF(ISNUMBER(G14),IF(AND(0.15<G$8,0.21>G$8),IF(ST!G5>0,0.15,G$8),IF(G$8>0.2,G$8-ST!G5,G$8)),\"\"),\"\")","v":""},{"$f":"IFERROR(ST!H5*D14,\"\")","v":""},{"$f":"IFERROR(IF(AND(E$8=\"ws\",ST!L5>0),ST!L5,IF(ST!K5>0,ST!K5,IF(ST!J5>0,ST!J5,\"\"))),\"\")","v":""},"","",null,null,"Megrendelő"]
[4,{"$f":"IFERROR(IF(ST!C6>0,ST!C6,\"\"),\"\")","v":""},{"$f":"IFERROR(IF(ST!D6>0,ST!D6,\"\"),\"\")","v":""},null,{"$f":"IFERROR(IF(ISNUMBER(G15),IF(AND(0.15<G$8,0.21>G$8),IF(ST!G6>0,0.15,G$8),IF(G$8>0.2,G$8-ST!G6,G$8)),\"\"),\"\")","v":""},{"$f":"IFERROR(ST!H6*D15,\"\")","v":""},{"$f":"IFERROR(IF(AND(E$8=\"ws\",ST!L6>0),ST!L6,IF(ST!K6>0,ST!K6,IF(ST!J6>0,ST!J6,\"\"))),\"\")","v":""},"","",null,null,"ABAC dugattyús kompresszorok"]
[5,{"$f":"IFERROR(IF(ST!C7>0,ST!C7,\"\"),\"\")","v":""},{"$f":"IFERROR(IF(ST!D7>0,ST!D7,\"\"),\"\")","v":""},null,{"$f":"IFERROR(IF(ISNUMBER(G16),IF(AND(0.15<G$8,0.21>G$8),IF(ST!G7>0,0.15,G$8),IF(G$8>0.2,G$8-ST!G7,G$8)),\"\"),\"\")","v":""},{"$f":"IFERROR(ST!H7*D16,\"\")","v":""},{"$f":"IFERROR(IF(AND(E$8=\"ws\",ST!L7>0),ST!L7,IF(ST!K7>0,ST!K7,IF(ST!J7>0,ST!J7,\"\"))),\"\")","v":""},"","",null,null,"ABAC CleanAir fogászati kompresszor"]
[6,{"$f":"IFERROR(IF(ST!C8>0,ST!C8,\"\"),\"\")","v":""},{"$f":"IFERROR(IF(ST!D8>0,ST!D8,\"\"),\"\")","v":""},null,{"$f":"IFERROR(IF(ISNUMBER(G17),IF(AND(0.15<G$8,0.21>G$8),IF(ST!G8>0,0.15,G$8),IF(G$8>0.2,G$8-ST!G8,G$8)),\"\"),\"\")","v":""},{"$f":"IFERROR(ST!H8*D17,\"\")","v":""},{"$f":"IFERROR(IF(AND(E$8=\"ws\",ST!L8>0),ST!L8,IF(ST!K8>0,ST!K8,IF(ST!J8>0,ST!J8,\"\"))),\"\")","v":""},"","",null,null,"AGRE ipari dugattyús kompresszorok",null,null,null,null,null,null,"ABAC dugattyús ",null,null,"CleanAir olajmentes ",null,null,"AGRE ipari",null,null,"EngineAir bemzin és dizel",null,null,"MEGRENDELŐ"]
[7,{"$f":"IFERROR(IF(ST!C9>0,ST!C9,\"\"),\"\")","v":""},{"$f":"IFERROR(IF(ST!D9>0,ST!D9,\"\"),\"\")","v":""},null,{"$f":"IFERROR(IF(ISNUMBER(G18),IF(AND(0.15<G$8,0.21>G$8),IF(ST!G9>0,0.15,G$8),IF(G$8>0.2,G$8-ST!G9,G$8)),\"\"),\"\")","v":""},{"$f":"IFERROR(ST!H9*D18,\"\")","v":""},{"$f":"IFERROR(IF(AND(E$8=\"ws\",ST!L9>0),ST!L9,IF(ST!K9>0,ST!K9,IF(ST!J9>0,ST!J9,\"\"))),\"\")","v":""},"","",null,null,"ALUP SONETTO csavarkomp 2,2-15kW",null,null,null,null,null,null,"garázsipari kompresszorok",null,null,"dugattyús kompresszorok",null,null,"dugattyús kompresszorok",null,null,"üzemű dugattyús kompr"]
[8,{"$f":"IFERROR(IF(ST!C10>0,ST!C10,\"\"),\"\")","v":""},{"$f":"IFERROR(IF(ST!D10>0,ST!D10,\"\"),\"\")","v":""},null,{"$f":"IFERROR(IF(ISNUMBER(G19),IF(AND(0.15<G$8,0.21>G$8),IF(ST!G10>0,0.15,G$8),IF(G$8>0.2,G$8-ST!G10,G$8)),\"\"),\"\")","v":""},{"$f":"IFERROR(ST!H10*D19,\"\")","v":""},{"$f":"IFERROR(IF(AND(E$8=\"ws\",ST!L10>0),ST!L10,IF(ST!K10>0,ST!K10,IF(ST!J10>0,ST!J10,\"\"))),\"\")","v":""},"","",null,null,"ALUP SCK csavarkomp 4-75kW"]
[9,{"$f":"IFERROR(IF(ST!C11>0,ST!C11,\"\"),\"\")","v":""},{"$f":"IFERROR(IF(ST!D11>0,ST!D11,\"\"),\"\")","v":""},null,{"$f":"IFERROR(IF(ISNUMBER(G20),IF(AND(0.15<G$8,0.21>G$8),IF(ST!G11>0,0.15,G$8),IF(G$8>0.2,G$8-ST!G11,G$8)),\"\"),\"\")","v":""},{"$f":"IFERROR(ST!H11*D20,\"\")","v":""},{"$f":"IFERROR(IF(AND(E$8=\"ws\",ST!L11>0),ST!L11,IF(ST!K11>0,ST!K11,IF(ST!J11>0,ST!J11,\"\"))),\"\")","v":""},"","",null,null,"ALUP LARGO, ALLEGRO csavarkompr"]
[10,{"$f":"IFERROR(IF(ST!C12>0,ST!C12,\"\"),\"\")","v":""},{"$f":"IFERROR(IF(ST!D12>0,ST!D12,\"\"),\"\")","v":""},null,{"$f":"IFERROR(IF(ISNUMBER(G21),IF(AND(0.15<G$8,0.21>G$8),IF(ST!G12>0,0.15,G$8),IF(G$8>0.2,G$8-ST!G12,G$8)),\"\"),\"\")","v":""},{"$f":"IFERROR(ST!H12*D21,\"\")","v":""},{"$f":"IFERROR(IF(AND(E$8=\"ws\",ST!L12>0),ST!L12,IF(ST!K12>0,ST!K12,IF(ST!J12>0,ST!J12,\"\"))),\"\")","v":""},"","",null,null,"ALUP Hűtveszárítók"]
[11,{"$f":"IFERROR(IF(ST!C13>0,ST!C13,\"\"),\"\")","v":""},{"$f":"IFERROR(IF(ST!D13>0,ST!D13,\"\"),\"\")","v":""},null,{"$f":"IFERROR(IF(ISNUMBER(G22),IF(AND(0.15<G$8,0.21>G$8),IF(ST!G13>0,0.15,G$8),IF(G$8>0.2,G$8-ST!G13,G$8)),\"\"),\"\")","v":""},{"$f":"IFERROR(ST!H13*D22,\"\")","v":""},{"$f":"IFERROR(IF(AND(E$8=\"ws\",ST!L13>0),ST!L13,IF(ST!K13>0,ST!K13,IF(ST!J13>0,ST!J13,\"\"))),\"\")","v":""},"","",null,null,"ALUP szűrők"]
[12,{"$f":"IFERROR(IF(ST!C14>0,ST!C14,\"\"),\"\")","v":""},{"$f":"IFERROR(IF(ST!D14>0,ST!D14,\"\"),\"\")","v":""},null,{"$f":"IFERROR(IF(ISNUMBER(G23),IF(AND(0.15<G$8,0.21>G$8),IF(ST!G14>0,0.15,G$8),IF(G$8>0.2,G$8-ST!G14,G$8)),\"\"),\"\")","v":""},{"$f":"IFERROR(ST!H14*D23,\"\")","v":""},{"$f":"IFERROR(IF(AND(E$8=\"ws\",ST!L14>0),ST!L14,IF(ST!K14>0,ST!K14,IF(ST!J14>0,ST!J14,\"\"))),\"\")","v":""},"","",null,null,"ALUP SpiralAir -Scroll kompresszor"]
[13,{"$f":"IFERROR(IF(ST!C15>0,ST!C15,\"\"),\"\")","v":""},{"$f":"IFERROR(IF(ST!D15>0,ST!D15,\"\"),\"\")","v":""},null,{"$f":"IFERROR(IF(ISNUMBER(G24),IF(AND(0.15<G$8,0.21>G$8),IF(ST!G15>0,0.15,G$8),IF(G$8>0.2,G$8-ST!G15,G$8)),\"\"),\"\")","v":""},{"$f":"IFERROR(ST!H15*D24,\"\")","v":""},{"$f":"IFERROR(IF(AND(E$8=\"ws\",ST!L15>0),ST!L15,IF(ST!K15>0,ST!K15,IF(ST!J15>0,ST!J15,\"\"))),\"\")","v":""},"","",null,null,"ALUP dugattyús kompresszorok"]
[14,{"$f":"IFERROR(IF(ST!C16>0,ST!C16,\"\"),\"\")","v":""},{"$f":"IFERROR(IF(ST!D16>0,ST!D16,\"\"),\"\")","v":""},null,{"$f":"IFERROR(IF(ISNUMBER(G25),IF(AND(0.15<G$8,0.21>G$8),IF(ST!G16>0,0.15,G$8),IF(G$8>0.2,G$8-ST!G16,G$8)),\"\"),\"\")","v":""},{"$f":"IFERROR(ST!H16*D25,\"\")","v":""},{"$f":"IFERROR(IF(AND(E$8=\"ws\",ST!L16>0),ST!L16,IF(ST!K16>0,ST!K16,IF(ST!J16>0,ST!J16,\"\"))),\"\")","v":""},"","",null,null,"OMEGA vonali szűrők"]
[15,{"$f":"IFERROR(IF(ST!C17>0,ST!C17,\"\"),\"\")","v":""},{"$f":"IFERROR(IF(ST!D17>0,ST!D17,\"\"),\"\")","v":""},null,{"$f":"IFERROR(IF(ISNUMBER(G26),IF(AND(0.15<G$8,0.21>G$8),IF(ST!G17>0,0.15,G$8),IF(G$8>0.2,G$8-ST!G17,G$8)),\"\"),\"\")","v":""},{"$f":"IFERROR(ST!H17*D26,\"\")","v":""},{"$f":"IFERROR(IF(AND(E$8=\"ws\",ST!L17>0),ST!L17,IF(ST!K17>0,ST!K17,IF(ST!J17>0,ST!J17,\"\"))),\"\")","v":""},"","",null,null,"OMEGA ciklonszűrők"]
[16,{"$f":"IFERROR(IF(ST!C18>0,ST!C18,\"\"),\"\")","v":""},{"$f":"IFERROR(IF(ST!D18>0,ST!D18,\"\"),\"\")","v":""},null,{"$f":"IFERROR(IF(ISNUMBER(G27),IF(AND(0.15<G$8,0.21>G$8),IF(ST!G18>0,0.15,G$8),IF(G$8>0.2,G$8-ST!G18,G$8)),\"\"),\"\")","v":""},{"$f":"IFERROR(ST!H18*D27,\"\")","v":""},{"$f":"IFERROR(IF(AND(E$8=\"ws\",ST!L18>0),ST!L18,IF(ST!K18>0,ST!K18,IF(ST!J18>0,ST!J18,\"\"))),\"\")","v":""},"","",null,null,"OMEGA olaj-víz szétválasztók",null,null,null,null,null,null,"ALUP SCK sorozatú ékszíjas",null,null,"ALUP LARGO és ALLEGRO",null,null,"ALUP Sonetto és SCK mini",null,null,"SpiralAir olajmentes"]
[17,{"$f":"IFERROR(IF(ST!C19>0,ST!C19,\"\"),\"\")","v":""},{"$f":"IFERROR(IF(ST!D19>0,ST!D19,\"\"),\"\")","v":""},null,{"$f":"IFERROR(IF(ISNUMBER(G28),IF(AND(0.15<G$8,0.21>G$8),IF(ST!G19>0,0.15,G$8),IF(G$8>0.2,G$8-ST!G19,G$8)),\"\"),\"\")","v":""},{"$f":"IFERROR(ST!H19*D28,\"\")","v":""},{"$f":"IFERROR(IF(AND(E$8=\"ws\",ST!L19>0),ST!L19,IF(ST!K19>0,ST!K19,IF(ST!J19>0,ST!J19,\"\"))),\"\")","v":""},"","",null,null,"ABAC sűrítők",null,null,null,null,null,null,"csavarkompresszor 4-75kW",null,null,"csavarkompr 7,5-250kW",null,null,"csavarkompr. 2,2-15kW",null,null,"spirálkompresszorok"]
[18,{"$f":"IFERROR(IF(ST!C20>0,ST!C20,\"\"),\"\")","v":""},{"$f":"IFERROR(IF(ST!D20>0,ST!D20,\"\"),\"\")","v":""},null,{"$f":"IFERROR(IF(ISNUMBER(G29),IF(AND(0.15<G$8,0.21>G$8),IF(ST!G20>0,0.15,G$8),IF(G$8>0.2,G$8-ST!G20,G$8)),\"\"),\"\")","v":""},{"$f":"IFERROR(ST!H20*D29,\"\")","v":""},{"$f":"IFERROR(IF(AND(E$8=\"ws\",ST!L20>0),ST!L20,IF(ST!K20>0,ST!K20,IF(ST!J20>0,ST!J20,\"\"))),\"\")","v":""},"","",null,null,"CONDOR nyomáskapcsolók"]
[19,{"$f":"IFERROR(IF(ST!C21>0,ST!C21,\"\"),\"\")","v":""},{"$f":"IFERROR(IF(ST!D21>0,ST!D21,\"\"),\"\")","v":""},null,{"$f":"IFERROR(IF(ISNUMBER(G30),IF(AND(0.15<G$8,0.21>G$8),IF(ST!G21>0,0.15,G$8),IF(G$8>0.2,G$8-ST!G21,G$8)),\"\"),\"\")","v":""},{"$f":"IFERROR(ST!H21*D30,\"\")","v":""},{"$f":"IFERROR(IF(AND(E$8=\"ws\",ST!L21>0),ST!L21,IF(ST!K21>0,ST!K21,IF(ST!J21>0,ST!J21,\"\"))),\"\")","v":""},"","",null,null,"Tartályok"]
[20,{"$f":"IFERROR(IF(ST!C22>0,ST!C22,\"\"),\"\")","v":""},{"$f":"IFERROR(IF(ST!D22>0,ST!D22,\"\"),\"\")","v":""},null,{"$f":"IFERROR(IF(ISNUMBER(G31),IF(AND(0.15<G$8,0.21>G$8),IF(ST!G22>0,0.15,G$8),IF(G$8>0.2,G$8-ST!G22,G$8)),\"\"),\"\")","v":""},{"$f":"IFERROR(ST!H22*D31,\"\")","v":""},{"$f":"IFERROR(IF(AND(E$8=\"ws\",ST!L22>0),ST!L22,IF(ST!K22>0,ST!K22,IF(ST!J22>0,ST!J22,\"\"))),\"\")","v":""},"","",null,null,"Egyéb alaktrészek"]
[21,{"$f":"IFERROR(IF(ST!C23>0,ST!C23,\"\"),\"\")","v":""},{"$f":"IFERROR(IF(ST!D23>0,ST!D23,\"\"),\"\")","v":""},null,{"$f":"IFERROR(IF(ISNUMBER(G32),IF(AND(0.15<G$8,0.21>G$8),IF(ST!G23>0,0.15,G$8),IF(G$8>0.2,G$8-ST!G23,G$8)),\"\"),\"\")","v":""},{"$f":"IFERROR(ST!H23*D32,\"\")","v":""},{"$f":"IFERROR(IF(AND(E$8=\"ws\",ST!L23>0),ST!L23,IF(ST!K23>0,ST!K23,IF(ST!J23>0,ST!J23,\"\"))),\"\")","v":""},"",""]
[22,{"$f":"IFERROR(IF(ST!C24>0,ST!C24,\"\"),\"\")","v":""},{"$f":"IFERROR(IF(ST!D24>0,ST!D24,\"\"),\"\")","v":""},null,{"$f":"IFERROR(IF(ISNUMBER(G33),IF(AND(0.15<G$8,0.21>G$8),IF(ST!G24>0,0.15,G$8),IF(G$8>0.2,G$8-ST!G24,G$8)),\"\"),\"\")","v":""},{"$f":"IFERROR(ST!H24*D33,\"\")","v":""},{"$f":"IFERROR(IF(AND(E$8=\"ws\",ST!L24>0),ST!L24,IF(ST!K24>0,ST!K24,IF(ST!J24>0,ST!J24,\"\"))),\"\")","v":""},"",""]
[23,{"$f":"IFERROR(IF(ST!C25>0,ST!C25,\"\"),\"\")","v":""},{"$f":"IFERROR(IF(ST!D25>0,ST!D25,\"\"),\"\")","v":""},null,{"$f":"IFERROR(IF(ISNUMBER(G34),IF(AND(0.15<G$8,0.21>G$8),IF(ST!G25>0,0.15,G$8),IF(G$8>0.2,G$8-ST!G25,G$8)),\"\"),\"\")","v":""},{"$f":"IFERROR(ST!H25*D34,\"\")","v":""},{"$f":"IFERROR(IF(AND(E$8=\"ws\",ST!L25>0),ST!L25,IF(ST!K25>0,ST!K25,IF(ST!J25>0,ST!J25,\"\"))),\"\")","v":""},"",""]
[24,{"$f":"IFERROR(IF(ST!C26>0,ST!C26,\"\"),\"\")","v":""},{"$f":"IFERROR(IF(ST!D26>0,ST!D26,\"\"),\"\")","v":""},null,{"$f":"IFERROR(IF(ISNUMBER(G35),IF(AND(0.15<G$8,0.21>G$8),IF(ST!G26>0,0.15,G$8),IF(G$8>0.2,G$8-ST!G26,G$8)),\"\"),\"\")","v":""},{"$f":"IFERROR(ST!H26*D35,\"\")","v":""},{"$f":"IFERROR(IF(AND(E$8=\"ws\",ST!L26>0),ST!L26,IF(ST!K26>0,ST!K26,IF(ST!J26>0,ST!J26,\"\"))),\"\")","v":""},"",""]
[25,{"$f":"IFERROR(IF(ST!C27>0,ST!C27,\"\"),\"\")","v":""},{"$f":"IFERROR(IF(ST!D27>0,ST!D27,\"\"),\"\")","v":""},null,{"$f":"IFERROR(IF(ISNUMBER(G36),IF(AND(0.15<G$8,0.21>G$8),IF(ST!G27>0,0.15,G$8),IF(G$8>0.2,G$8-ST!G27,G$8)),\"\"),\"\")","v":""},{"$f":"IFERROR(ST!H27*D36,\"\")","v":""},{"$f":"IFERROR(IF(AND(E$8=\"ws\",ST!L27>0),ST!L27,IF(ST!K27>0,ST!K27,IF(ST!J27>0,ST!J27,\"\"))),\"\")","v":""},"",""]
[26,{"$f":"IFERROR(IF(ST!C28>0,ST!C28,\"\"),\"\")","v":""},{"$f":"IFERROR(IF(ST!D28>0,ST!D28,\"\"),\"\")","v":""},null,{"$f":"IFERROR(IF(ISNUMBER(G37),IF(AND(0.15<G$8,0.21>G$8),IF(ST!G28>0,0.15,G$8),IF(G$8>0.2,G$8-ST!G28,G$8)),\"\"),\"\")","v":""},{"$f":"IFERROR(ST!H28*D37,\"\")","v":""},{"$f":"IFERROR(IF(AND(E$8=\"ws\",ST!L28>0),ST!L28,IF(ST!K28>0,ST!K28,IF(ST!J28>0,ST!J28,\"\"))),\"\")","v":""},"","",null,null,null,null,null,null,null,null,null,"ALUP ADQ és COOL",null,null,"ALUP ",null,null,"OMEGA",null,null,"OMEGA",null,null,"OMEGA"]
[27,{"$f":"IFERROR(IF(ST!C29>0,ST!C29,\"\"),\"\")","v":""},{"$f":"IFERROR(IF(ST!D29>0,ST!D29,\"\"),\"\")","v":""},null,{"$f":"IFERROR(IF(ISNUMBER(G38),IF(AND(0.15<G$8,0.21>G$8),IF(ST!G29>0,0.15,G$8),IF(G$8>0.2,G$8-ST!G29,G$8)),\"\"),\"\")","v":""},{"$f":"IFERROR(ST!H29*D38,\"\")","v":""},{"$f":"IFERROR(IF(AND(E$8=\"ws\",ST!L29>0),ST!L29,IF(ST!K29>0,ST!K29,IF(ST!J29>0,ST!J29,\"\"))),\"\")","v":""},"","",null,null,null,null,null,null,null,null,null,"hűtveszárítók",null,null,"vonali szűrők",null,null,"vonali szűrők",null,null,"ciklon leválasztók",null,null,"Olaj-víz szétválasztók"]
["Súly (kg):",null,{"$f":"SUM(F12:F38)/1000","v":0},{"$f":"\"Nettó ár összesen \"&IF($I$7=1,\"HUF\",\"EUR\")","v":"Nettó ár összesen HUF"},null,null,null,null,{"$f":"SUM(I12:I38)","v":0}]
["Szállítási mód:",null,1,{"$f":"\"ÁFA \"&IF($I$7=1,\"HUF\",\"EUR\")","v":"ÁFA HUF"},null,null,null,null,{"$f":"I39*0.27","v":0}]
[30,{"$f":"A41*I9","v":10200},{"$f":"IF($I$7=1,B41,A41)","v":10200},{"$f":"IF($I$7=1,I39,I39*I$9)","v":0},null,null,null,null,{"$f":"IF($I$7=2,I39,I39/I$9)","v":0}]
[null,{"$f":"IF(C39<3,3,IF(C39<5,5,IF(C39<10,10,IF(C39<15,15,IF(C39<20,20,IF(C39<25,25,IF(C39<31,31,IF(C39<50,50,\"túlsúly\"))))))))","v":3},{"$f":"IF($I$7=1,D42+H42,(D42+H42)/I9)","v":1566},{"$f":"VLOOKUP(B42,Segéd!A$25:C$33,3,0)","v":1166},null,null,{"$f":"IF(D41<50000,50000,IF(D41<100000,100000,IF(D41<300000,300000,IF(D41<500000,500000,\"Limit\"))))","v":50000},{"$f":"IF(OR(G7=4,AND(I8=1,G7=1)),VLOOKUP(G$42,Segéd!A$35:B$38,2,0),0)","v":400}]
[{"$f":"\"Szállítási díj: \"&IF($I$7=1,\"HUF\",\"EUR\")","v":"Szállítási díj: HUF"},null,{"$f":"IF(I8=2,0,(IF(C40=1,IF(D41>50000,0,C42),IF(I41>400,0,C41))))","v":1566},{"$f":"\"Bruttó ár öszesen \"&IF($I$7=1,\"HUF\",\"EUR\")","v":"Bruttó ár öszesen HUF"},null,null,null,null,{"$f":"I39+I40+C43","v":1566}]
[]
[]
[]
[]
[null,null,null,null,null,null,null,null,null,null,null,null,null,null,null,null,null,null,"Légtartályok 11, 16, 35 bar",null,null,"Condor és NE-MA",null,null,"ABAC sűrítők és ",null,null,"Általános kompresszor "]
[null,null,null,null,null,null,null,null,null,null,null,null,null,null,null,null,null,null,"90- 10 000l-ig","Légtartályok",null,"nyomáskapcsolók",null,null,"alkatrészeik",null,null,"alkatrészek"]
[]
[]
[]
[]
[]
[]
[]
[]
[]
[null,null,"+36-30/626 8687",null,null,null,"+36-30/201-4931"]
[null,null,"ertekesites@kapitarkft.hu",null,null,null,"info@techtomat.hu"]

{"sheet":"ABAC Kompresszor","index":2,"n_rows":576,"n_cols":19,"rows_kept":576,"cut":false,"hidden":false,"merged":[[11,14,15,15],[190,4,190,5],[25,6,26,9],[0,3,0,4],[19,3,19,4],[1,3,1,4],[2,3,2,4],[23,12,23,15],[25,12,26,15],[23,6,23,8],[24,6,24,8],[20,3,20,4],[31,4,35,5],[44,4,44,5],[45,4,45,5],[46,4,46,5],[455,4,460,5],[191,4,191,5],[80,4,84,5],[93,4,93,5],[94,4,94,5],[95,4,95,5],[140,4,144,5],[189,4,189,5],[26,3,26,4],[25,3,25,4],[24,3,24,4],[23,3,23,4],[21,3,21,4]]}
["r","TARTALOM"]
[null,"Árlista"]
[null,"Megrendelő"]
[null,"ABAC dugattyús kompresszorok"]
[null,"ABAC CleanAir fogászati kompresszor"]
[null,"AGRE ipari dugattyús kompresszorok"]
[null,"ALUP SONETTO csavarkomp 2,2-15kW"]
[null,"ALUP SCK csavarkomp 4-75kW"]
[null,"ALUP LARGO, ALLEGRO csavarkompr"]
[null,"ALUP Hűtveszárítók"]
[null,"ALUP szűrők"]
[null,"ALUP SpiralAir -Scroll kompresszor"]
[null,"ALUP dugattyús kompresszorok"]
[null,"OMEGA vonali szűrők"]
[null,"OMEGA ciklonszűrők"]
[null,"OMEGA olaj-víz szétválasztók"]
[null,"ABAC sűrítők"]
[null,"CONDOR nyomáskapcsolók"]
[null,"Tartályok"]
[null,"Egyéb alaktrészek"]
[]
[]
[]
[]
[]
[]
[]
[]
[]
[]
[]
[null,null,null,null,"ABAC BASE LINE\nSZÉRIA"]
[]
[]
[]
[]
[]
[null,null,null,"Cikkszám","Model","Leirat","Henger/\nFokozat","Tartály \nl","Szívott \nl/min","Teljes.\nHP","Teljes.\nkW","Ford sz.\nrpm","Volt","Max\nBar","dB(A)","Méret \n(mm)","Tömeg \nkg","Nettó ár"]
[1,null,null,1129100008,"VENTO B15 baseline","Direkthajt, olajkenés","1 / 1",6,160,1.2,1.5,3400,"230/1/50 ",8,97,"330x360x350",4.5,{"$f":"VLOOKUP(D39,Árlista!B:I,8,0)","v":32100}]
[null,null,null,1129100009,"POLE POSITION B15 baseline","Direkthajt, olajkenés","1 / 1",24,160,1.2,1.5,3400,"230/1/50 ",8,97,"250x565x420",12,{"$f":"VLOOKUP(D40,Árlista!B:I,8,0)","v":36100}]
[2,null,null,1129100007,"POLE POSITION B20 baseline","Direkthajt, olajkenés","1 / 1",24,190,1.5,2,3400,"230/1/50 ",8,97,"250x565x420",20,{"$f":"VLOOKUP(D41,Árlista!B:I,8,0)","v":37500}]
[3,null,null,1129100006,"MONTECARLO B20 baseline","Direkthajt, olajkenés","1 / 1",50,190,1.5,2,3400,"230/1/50 ",8,97,"250x565x420",20,{"$f":"VLOOKUP(D42,Árlista!B:I,8,0)","v":47900}]
[]
[]
[null,null,null,null,"Megkötésekkel rendelhető"]
[null,null,null,null,"Raktáron lévő"]
[null,null,null,null,"Rendelésre"]
[]
[]
[null,null,null,"Cikkszám","Model","Leirat","Henger/\nFokozat","Tartály \nl","Szívott \nl/min","Teljes.\nHP","Teljes.\nkW","Ford sz.\nrpm","Volt","Max\nBar","dB(A)","Méret \n(mm)","Tömeg \nkg","Nettó ár"]
[7,null,null,1121450003,"B26/50CM2 230/50CE BASELINE","Ékszíj, mobil","1 / 1",50,210,1.5,2,1075,"230/1/50 ",10,93,"870x370x780",45,{"$f":"VLOOKUP(D51,Árlista!B:I,8,0)","v":131400}]
[8,null,null,1121450004,"B26/90CM2 230/50CE BASELINE","Ékszíj, mobil","1 / 1",-90,210,1.5,2,1075,"230/1/50 ",10,93,"1010x415x900",52,{"$f":"VLOOKUP(D52,Árlista!B:I,8,0)","v":141000}]
[9,null,null,1121450005,"B26B/90CM3 230/50CE BASELINE","Ékszíj, mobil","1 / 1",-90,240,2.2000000000000002,3,1300,"230/1/50 ",10,93,"1010x415x900",55,{"$f":"VLOOKUP(D53,Árlista!B:I,8,0)","v":147300}]
[10,null,null,1121450006,"B26B/150 CM3 V230  BASELINE","Ékszíj, mobil","1 / 1",150,240,2.2000000000000002,3,1300,"230/1/50 ",10,93,"1375x420x950",82,{"$f":"VLOOKUP(D54,Árlista!B:I,8,0)","v":168300}]
[11,null,null,1121450007,"B26B/200 FM3 BASELINE","Ékszíj, telepített","1 / 1",200,240,2.2000000000000002,3,1300,"230/1/50 ",10,95,"1500x470x1110",88,{"$f":"VLOOKUP(D55,Árlista!B:I,8,0)","v":172400}]
[]
[]
[]
[]
[]
[]
[]
[]
[]
[]
[null,null,null,"Cikkszám","Model","Leirat","Henger/\nFokozat","Tartály \nl","Szívott \nl/min","Teljes.\nHP","Teljes.\nkW","Ford sz.\nrpm","Volt","Max\nBar","dB(A)","Méret \n(mm)","Tömeg \nkg","Nettó ár"]
[null,null,null,1121010040,"MULTIBOX COMPRESSOR","Bordásszíj, olajment","1 / 1",6,160,1.5,1.1000000000000001,null,"230/1/50 ",8,68,"396x296x322",12.7,{"$f":"VLOOKUP(D67,Árlista!B:I,8,0)","v":99000}]
[null,null,null,1121010041,"MULTIBOX COMBY","Bordásszíj, olajment","1 / 1",6,160,1.5,1.1000000000000001,null,"230/1/50 ",8,68,"520x360x618",16.8,{"$f":"VLOOKUP(D68,Árlista!B:I,8,0)","v":124000}]
[]
[]
[]
[]
[]
[]
[]
[]
[null,null,null,"Cikkszám","Model","Leirat","Henger/\nFokozat","Tartály \nl","Szívott \nl/min","Teljes.\nHP","Teljes.\nkW","Ford sz.\nrpm","Volt","Max\nBar","dB(A)","Méret \n(mm)","Tömeg \nkg","Nettó ár"]
[null,null,null,8973005553,"MINI 20 AUTOM.",null,"1 / 1",1.5,20,null,0.13,null,"230/1/50 ",8,38,"220 x 470 x 340",18.5,{"$f":"VLOOKUP(D78,Árlista!B:I,8,0)","v":105200}]
[null,null,null,8973005554,"JUNIOR 30 AUT.",null,"1 / 1",6,30,null,0.19,null,"230/1/50 ",8,40,"340x340x500",18.8,{"$f":"VLOOKUP(D79,Árlista!B:I,8,0)","v":119500}]
[null,null,null,8973005552,"PRO 50",null,"1 / 1",9,50,null,0.34,null,"230/1/50 ",8,43,"350 x 350 x 500",24.4,{"$f":"VLOOKUP(D80,Árlista!B:I,8,0)","v":167600}]
[null,null,null,null,"ABAC LINE\nSZÉRIA"]
[]
[]
[]
[]
[]
[null,null,null,"Cikkszám","Model","Leirat","Henger/\nFokozat","Tartály \nl","Szívott \nl/min","Teljes.\nHP","Teljes.\nkW","Ford sz.\nrpm","Volt","Max\nBar","dB(A)","Méret \n(mm)","Tömeg \nkg","Nettó ár"]
[1,null,null,1129100032,"COMPY O15 új","Bordásszíj, olajment","1 / 1",0,180,1.5,1.1000000000000001,3400,"230/1/50 ",8,97,"280x180x347",4.5,{"$f":"VLOOKUP(D88,Árlista!B:I,8,0)","v":28600}]
[2,null,null,1129100029,"START O15 új","Bordásszíj, olajment","1 / 1",6,180,1.5,1.1000000000000001,3400,"230/1/50 ",8,97,"330x360x350",9.5,{"$f":"VLOOKUP(D89,Árlista!B:I,8,0)","v":36800}]
[3,null,null,1129100049,"POLE POSITION O15 új","Bordásszíj, olajment","1 / 1",24,180,1.5,1.1000000000000001,3400,"230/1/50 ",8,97,"250x565x420",20,{"$f":"VLOOKUP(D90,Árlista!B:I,8,0)","v":42500}]
[null,null,null,1129740357,"ABAC XPN O15","10 m tömlődobba ","1 / 1",0,160,1.5,1.1000000000000001,2450,"230/1/50 ",8,97,"278x378x442",8.5,{"$f":"VLOOKUP(D91,Árlista!B:I,8,0)","v":64700}]
[]
[]
[null,null,null,null,"Megkötésekkel rendelhető"]
[null,null,null,null,"Raktáron lévő"]
[null,null,null,null,"Rendelésre"]
[]
[]
[null,null,null,"Cikkszám","Model","Leirat","Henger/\nFokozat","Tartály \nl","Szívott \nl/min","Teljes.\nHP","Teljes.\nkW","Ford sz.\nrpm","Volt","Max\nBar","dB(A)","Méret \n(mm)","Tömeg \nkg","Nettó ár"]
[4,null,null,1129100034,"START L20  új","Direkt","1 / 1",6,220,2,1.5,2850,"230/1/50 ",10,94,"535x215x535",18.399999999999999,{"$f":"VLOOKUP(D100,Árlista!B:I,8,0)","v":38900}]
[5,null,null,1129100021,"POLE POSITION L20  új","Direkt","1 / 1",24,220,2,1.5,2850,"230/1/50 ",10,94,"570x255x590",24.6,{"$f":"VLOOKUP(D101,Árlista!B:I,8,0)","v":42100}]
[6,null,null,1129100023,"MONTECARLO L20  új","Direkt","1 / 1",50,220,2,1.5,2850,"230/1/50 ",10,94,"770x310x645",32.6,{"$f":"VLOOKUP(D102,Árlista!B:I,8,0)","v":54200}]
[]
[]
[]
[]
[]
[]
[null,null,null,"Cikkszám","Model","Leirat","Henger/\nFokozat","Tartály \nl","Szívott \nl/min","Teljes.\nHP","Teljes.\nkW","Ford sz.\nrpm","Volt","Max\nBar","dB(A)","Méret \n(mm)","Tömeg \nkg","Nettó ár"]
[7,null,null,4116024261,"A29 27 CM2   ","Ékszíj","2 / 1",27,255,2,1.5,1075,"230/1/50 ",10,93,"810x390x710",43,{"$f":"VLOOKUP(D110,Árlista!B:I,8,0)","v":133400}]
[8,null,null,4116024262,"A29 50 CM2   ","Ékszíj","2 / 1",50,255,2,1.5,1075,"230/1/50 ",10,93,"870x370x780",49,{"$f":"VLOOKUP(D111,Árlista!B:I,8,0)","v":139700}]
[9,null,null,4116024335,"A29 90 CM2   ","Ékszíj","2 / 1",90,255,2,1.5,1075,"230/1/50 ",10,93,"1010x415x900",56,{"$f":"VLOOKUP(D112,Árlista!B:I,8,0)","v":150800}]
[10,null,null,4116024254,"A29 150 CM2   ","Ékszíj","2 / 1",150,255,2,1.5,1075,"230/1/50 ",10,93,"1375x420x950",87,{"$f":"VLOOKUP(D113,Árlista!B:I,8,0)","v":166500}]
[11,null,null,4116024257,"A29B 50 CM3   ","Ékszíj","2 / 1",50,320,3,2.2000000000000002,1300,"230/1/50 ",10,95,"940x410x800",58,{"$f":"VLOOKUP(D114,Árlista!B:I,8,0)","v":150400}]
[12,null,null,4116024531,"A29B 50 CT3   ","Ékszíj","2 / 1",50,320,3,2.2000000000000002,1300,"400/3/50 ",10,95,"940x410x800",58,{"$f":"VLOOKUP(D115,Árlista!B:I,8,0)","v":150400}]
[14,null,null,4116024518,"A29B 90 CT3   ","Ékszíj","2 / 1",90,320,3,2.2000000000000002,1300,"400/3/50 ",10,95,"1010x415x900",56,{"$f":"VLOOKUP(D116,Árlista!B:I,8,0)","v":158800}]
[null,null,null,4116024564,"A29B 100CM3   ","Ékszíj","2 / 1",100,320,3,2.2000000000000002,1300,"230/1/50 ",10,95,"1010x415x900",56,{"$f":"VLOOKUP(D117,Árlista!B:I,8,0)","v":162200}]
[null,null,null,4116024565,"A29B 100 CT3   ","Ékszíj","2 / 1",100,320,3,2.2000000000000002,1300,"400/3/50 ",10,95,"1010x415x900",56,{"$f":"VLOOKUP(D118,Árlista!B:I,8,0)","v":162200}]
[15,null,null,4116024137,"A29B 150 CM3   ","Ékszíj","2 / 1",150,320,3,2.2000000000000002,1300,"230/1/50 ",10,95,"1375x420x950",87,{"$f":"VLOOKUP(D119,Árlista!B:I,8,0)","v":184900}]
[16,null,null,4116024138,"A29B 150 CT3   ","Ékszíj","2 / 1",150,320,3,2.2000000000000002,1300,"400/3/50 ",10,95,"1375x420x950",87,{"$f":"VLOOKUP(D120,Árlista!B:I,8,0)","v":184900}]
[17,null,null,4116024534,"A29B 200 CM3   ","Ékszíj","2 / 1",200,320,3,2.2000000000000002,1300,"230/1/50 ",10,95,"1500x470x1110",91,{"$f":"VLOOKUP(D121,Árlista!B:I,8,0)","v":199800}]
[18,null,null,4116024535,"A29B 200 CT3   ","Ékszíj","2 / 1",200,320,3,2.2000000000000002,1300,"400/3/50 ",10,95,"1500x470x1110",91,{"$f":"VLOOKUP(D122,Árlista!B:I,8,0)","v":199800}]
[]
[]
[]
[]
[]
[]
[]
[null,null,null,"Cikkszám","Model","Leirat","Henger/\nFokozat","Tartály \nl","Szívott \nl/min","Teljes.\nHP","Teljes.\nkW","Ford sz.\nrpm","Volt","Max\nBar","dB(A)","Méret \n(mm)","Tömeg \nkg","Nettó ár"]
[null,null,null,4116024519,"A39 90 CM3   ","Ékszíj","2 / 1",90,393,3,2.2000000000000002,1050,"230/1/50 ",10,93,"1180x460x930",72,{"$f":"VLOOKUP(D131,Árlista!B:I,8,0)","v":188700}]
[null,null,null,4116024520,"A39 90 CT3   ","Ékszíj","2 / 1",90,393,3,2.2000000000000002,1050,"400/3/50 ",10,93,"1180x460x930",72,{"$f":"VLOOKUP(D132,Árlista!B:I,8,0)","v":188700}]
[19,null,null,4116024149,"A39 150 CM3   ","Ékszíj","2 / 1",150,393,3,2.2000000000000002,1050,"230/1/50 ",10,93,"1375x420x950",87,{"$f":"VLOOKUP(D133,Árlista!B:I,8,0)","v":204300}]
[null,null,null,4116024150,"A39 150 CT3   ","Ékszíj","2 / 1",150,393,3,2.2000000000000002,1050,"400/3/50 ",10,93,"1375x420x950",87,{"$f":"VLOOKUP(D134,Árlista!B:I,8,0)","v":204300}]
[21,null,null,4116024151,"A39 200 CM3   ","Ékszíj","2 / 1",200,393,3,2.2000000000000002,1050,"230/1/50 ",10,93,"1500x470x1110",91,{"$f":"VLOOKUP(D135,Árlista!B:I,8,0)","v":219400}]
[22,null,null,4116024152,"A39 200 CT3   ","Ékszíj","2 / 1",200,393,3,2.2000000000000002,1050,"400/3/50 ",10,93,"1500x470x1110",91,{"$f":"VLOOKUP(D136,Árlista!B:I,8,0)","v":219400}]
[23,null,null,4116024548,"A39 270 CM3   ","Ékszíj","2 / 1",270,393,3,2.2000000000000002,1050,"230/1/50 ",10,93,"1530x595x1160",138,{"$f":"VLOOKUP(D137,Árlista!B:I,8,0)","v":232700}]
[24,null,null,4116024549,"A39 270 CT3   ","Ékszíj","2 / 1",270,393,3,2.2000000000000002,1050,"400/3/50 ",10,93,"1530x595x1160",138,{"$f":"VLOOKUP(D138,Árlista!B:I,8,0)","v":232700}]
[25]
[26]
[null,null,null,null,"ABAC PRO\nSZÉRIA"]
[]
[]
[]
[]
[]
[null,null,null,"Cikkszám","Model","Leirat","Henger/\nFokozat","Tartály \nl","Szívott \nl/min","Teljes.\nHP","Teljes.\nkW","Ford sz.\nrpm","Volt","Max\nBar","dB(A)","Méret \n(mm)","Tömeg \nkg","Nettó ár"]
[null,null,null,1121020388,"START O20P","Direkt, olajmentes","1 / 1",6,230,2,1.5,2850,"230/1/50 ",8,95,"535x215x535",15.88,{"$f":"VLOOKUP(D148,Árlista!B:I,8,0)","v":49800}]
[0,null,null,1121210969,"POLE POSITION O20P","Direkt, olajmentes","1 / 1",24,230,2,1.5,2850,"230/1/50 ",8,95,"570x250x590",24.5,{"$f":"VLOOKUP(D149,Árlista!B:I,8,0)","v":55500}]
[27,null,null,1121360898,"MONTECARLO O20P","Direkt, olajmentes","1 / 1",50,230,2,1.5,2850,"230/1/50 ",8,95,"770x310x645",30.5,{"$f":"VLOOKUP(D150,Árlista!B:I,8,0)","v":68400}]
[28]
[]
[]
[]
[]
[]
[]
[]
[]
[]
[]
[]
[]
[]
[]
[]
[]
[]
[null,null,null,"Cikkszám","Model","Leirat","Henger/\nFokozat","Tartály \nl","Szívott \nl/min","Teljes.\nHP","Teljes.\nkW","Ford sz.\nrpm","Volt","Max\nBar","SPL dB(A)","Méret \n(mm)","Tömeg \nkg","Nettó ár"]
[null,null,null,1129740290,"START SILENT OS7P","Direkt, olajmentes","2 / 1",6,140,0.75,0.56000000000000005,1420,"230/1/50 ",8,59,"363x279x521",17,{"$f":"VLOOKUP(D170,Árlista!B:I,8,0)","v":54200}]
[null,null,null,1129740325,"START SILENT OS10P","Direkt, olajmentes","2 / 1",6,165,1,0.75,1420,"230/1/50 ",8,59,"570x250x590",17,{"$f":"VLOOKUP(D171,Árlista!B:I,8,0)","v":59400}]
[null,null,null,1129740291,"START SILENT OS15P","Direkt, olajmentes","2 / 1",6,195,1.5,1.1000000000000001,1420,"230/1/50 ",8,59,"770x310x645",19,{"$f":"VLOOKUP(D172,Árlista!B:I,8,0)","v":57300}]
[null,null,null,1129740292,"START SILENT OS20P","Direkt, olajmentes","2 / 1",6,230,2,1.5,1420,"230/1/50 ",8,59,"770x310x645",19,{"$f":"VLOOKUP(D173,Árlista!B:I,8,0)","v":65900}]
[null,null,null,1129740293,"SILVERSTONE OS7P","Direkt, olajmentes","2 / 1",10,140,0.75,0.56000000000000005,1420,"230/1/50 ",9,59,"398x332x627",22,{"$f":"VLOOKUP(D174,Árlista!B:I,8,0)","v":59700}]
[null,null,null,1129740330,"SILVERSTONE OS15P","Direkt, olajmentes","2 / 1",10,195,1.5,1.1000000000000001,1420,"230/1/50 ",9,59,"398x332x627",24,{"$f":"VLOOKUP(D175,Árlista!B:I,8,0)","v":65100}]
[null,null,null,1129740295,"SILVERSTONE OS20P","Direkt, olajmentes","2 / 1",10,230,2,1.5,1420,"230/1/50 ",9,59,"398x332x627",24,{"$f":"VLOOKUP(D176,Árlista!B:I,8,0)","v":0}]
[null,null,null,1129740335,"HOCHENHEIM OS15P","Direkt, olajmentes","2 / 1",20,195,1.5,1.1000000000000001,1420,"230/1/50 ",9,59,"479x385x793",33,{"$f":"VLOOKUP(D177,Árlista!B:I,8,0)","v":0}]
[null,null,null,1129740336,"HOCHENHEIM OS20P","Direkt, olajmentes","2 / 1",20,230,2,1.5,1420,"230/1/50 ",9,59,"479x385x793",33,{"$f":"VLOOKUP(D178,Árlista!B:I,8,0)","v":80500}]
[null,null,null,1129740344,"PORTABLE ROLLCAGE OS15P","Direkt, olajmentes","2 / 1",9,195,1.5,1.1000000000000001,1420,"230/1/50 ",9,59,"497x480x477",34,{"$f":"VLOOKUP(D179,Árlista!B:I,8,0)","v":0}]
[null,null,null,1129740300,"PORTABLE ROLLCAGE OS20P","Direkt, olajmentes","2 / 1",9,230,2,1.5,1420,"230/1/50 ",9,59,"497x480x477",34,{"$f":"VLOOKUP(D180,Árlista!B:I,8,0)","v":94500}]
[null,null,null,1129740296,"POLE POSITION OS15P","Direkt, olajmentes","2 / 1",24,195,1.5,1.1000000000000001,1420,"230/1/50 ",9,59,"616x300x574",24,{"$f":"VLOOKUP(D181,Árlista!B:I,8,0)","v":59700}]
[null,null,null,1129740297,"POLE POSITION  OS20P","Direkt, olajmentes","2 / 1",24,230,2,1.5,1420,"230/1/50 ",9,59,"616x300x574",24,{"$f":"VLOOKUP(D182,Árlista!B:I,8,0)","v":68300}]
[null,null,null,1129740298,"MONTECARLO OS15P","Direkt, olajmentes","2 / 1",50,195,1.5,1.1000000000000001,1420,"230/1/50 ",9,59,"806x385x609",32,{"$f":"VLOOKUP(D183,Árlista!B:I,8,0)","v":67500}]
[null,null,null,1129740299,"MONTECARLO  OS20P","Direkt, olajmentes","2 / 1",50,230,2,1.5,1420,"230/1/50 ",9,59,"806x385x609",32,{"$f":"VLOOKUP(D184,Árlista!B:I,8,0)","v":76100}]
[]
[]
[]
[]
[29]
[null,null,null,null,"Megkötésekkel rendelhető"]
[null,null,null,null,"Raktáron lévő"]
[null,null,null,null,"Rendelésre"]
[]
[]
[]
[null,null,null,"Cikkszám","Model","Leirat","Henger/\nFokozat","Tartály \nl","Szívott \nl/min","Teljes.\nHP","Teljes.\nkW","Ford sz.\nrpm","Volt","Max\nBar","dB(A)","Méret \n(mm)","Tömeg \nkg","Nettó ár"]
[null,null,null,1129100042,"POLE POSITION L25P","Direkt","1 / 1",24,270,2.5,2,2850,"230/1/50 ",10,96,"570x255x590",24.5,{"$f":"VLOOKUP(D197,Árlista!B:I,8,0)","v":59800}]
[null,null,null,1129100048,"MONTECARLO L25P","Direkt","1 / 1",50,270,2.5,2,2850,"230/1/50 ",10,96,"770x310x645",31,{"$f":"VLOOKUP(D198,Árlista!B:I,8,0)","v":76600}]
[30,null,null,1129100045,"POLE POSITION L30P","Direkt","1 / 1",24,310,3,2.2000000000000002,2850,"230/1/50 ",10,97,"570x255x590",33,{"$f":"VLOOKUP(D199,Árlista!B:I,8,0)","v":76400}]
[31,null,null,1129100037,"MONTECARLO L30P","Direkt","1 / 1",50,310,3,2.2000000000000002,2850,"230/1/50 ",10,97,"770x310x645",36.5,{"$f":"VLOOKUP(D200,Árlista!B:I,8,0)","v":87600},{"$f":"IFERROR(MATCH($D200,Árlista!$B:$B,0),\"\")","v":617}]
[32,null,null,1121390600,"ESTORIL L30P","Direkt","1 / 1",90,310,3,2.2000000000000002,2850,"230/1/50 ",10,97,"1060x385x730",48,{"$f":"VLOOKUP(D201,Árlista!B:I,8,0)","v":110300}]
[33]
[34]
[]
[]
[]
[]
[]
[]
[null,null,null,"Cikkszám","Model","Leirat","Henger/\nFokozat","Tartály \nl","Szívott \nl/min","Teljes.\nHP","Teljes.\nkW","Ford sz.\nrpm","Volt","Max\nBar","dB(A)","Méret \n(mm)","Tömeg \nkg","Nettó ár"]
[null,null,null,1121020309,"START ROLLCAGE O20P","Direkt, olajmentes","1 / 1",9,230,1.5,2,2850,"230/1/50 ",8,95,"455x475x500",22,{"$f":"VLOOKUP(D211,Árlista!B:I,8,0)","v":80700}]
[null,null,null,1121090033,"SILVERSTONE O20P","Direkt, olajmentes","1 / 1",10,230,1.5,2,2850,"230/1/50 ",8,95,"420x360x700",22,{"$f":"VLOOKUP(D212,Árlista!B:I,8,0)","v":78400}]
[38,null,null,1129100051,"START ROLLCAGE L25P","Direkt","1 / 1",9,270,2,2.5,2850,"230/1/50 ",10,96,"480x510x550",31,{"$f":"VLOOKUP(D213,Árlista!B:I,8,0)","v":79000}]
[null,null,null,1129100062,"SILVERSTONE L25P","Direkt","1 / 1",10,270,2,2.5,2850,"230/1/50 ",10,96,"420x360x700",25,{"$f":"VLOOKUP(D214,Árlista!B:I,8,0)","v":80800}]
[null,null,null,1129100060,"PORTABLE ROLLCAGE L30P","Direkt","1 / 1",9,310,2.2000000000000002,3,2850,"230/1/50 ",10,97,"480x510x550",26,{"$f":"VLOOKUP(D215,Árlista!B:I,8,0)","v":118000}]
[39,null,null,1129100063,"HOCKENHEIM L30P","Direkt","1 / 1",20,310,2.2000000000000002,3,2850,"230/1/50 ",10,97,"420x640x770",28,{"$f":"VLOOKUP(D216,Árlista!B:I,8,0)","v":112100}]
[40]
[41]
[]
[]
[]
[]
[]
[]
[null,null,null,"Cikkszám","Model","Leirat","Henger/\nFokozat","Tartály \nl","Szívott \nl/min","Teljes.\nHP","Teljes.\nkW","Ford sz.\nrpm","Volt","Max\nBar","dB(A)","Méret \n(mm)","Tömeg \nkg","Nettó ár"]
[null,null,null,1121440197,"V30/9+9 CM 3","Direkt, V2","2 / 1","9+9",330,3,2.2000000000000002,1450,"230/1/50 ",10,93,"650x790x670",60,{"$f":"VLOOKUP(D226,Árlista!B:I,8,0)","v":251500}]
[null,null,null,1121090851,"V30/20 PCM 3","Direkt, V2","2 / 1",20,330,3,2.2000000000000002,1450,"230/1/50 ",10,93,"490x645x810",48,{"$f":"VLOOKUP(D227,Árlista!B:I,8,0)","v":205200}]
[42,null,null,1121430329,"V30/50 VERTICAL CM3","Direkt, V2","2 / 1",50,330,3,2.2000000000000002,1450,"230/1/50 ",10,93,"820x410x800",54,{"$f":"VLOOKUP(D228,Árlista!B:I,8,0)","v":220200}]
[43,null,null,1121360249,"V30/50  CM 3","Direkt, V2","2 / 1",50,330,3,2.2000000000000002,1450,"230/1/50 ",10,93,"520x520x960",50,{"$f":"VLOOKUP(D229,Árlista!B:I,8,0)","v":184500}]
[44,null,null,1121370226,"V30/90 CM 3","Direkt, V2","2 / 1",90,330,3,2.2000000000000002,1450,"230/1/50 ",10,93,"1000x410x900",77,{"$f":"VLOOKUP(D230,Árlista!B:I,8,0)","v":197800}]
[45]
[46]
[]
[]
[]
[]
[]
[]
[null,null,null,"Cikkszám","Model","Leirat","Henger/\nFokozat","Tartály \nl","Szívott \nl/min","Teljes.\nHP","Teljes.\nkW","Ford sz.\nrpm","Volt","Max\nBar","dB(A)","Méret \n(mm)","Tömeg \nkg","Nettó ár"]
[null,null,null,4116024264,"PRO A29B 27 CM2  ","Ékszíj, 230V","2 / 1",27,255,2,1.5,1075,"230/1/50 ",10,93,"870x370x780",49,{"$f":"VLOOKUP(D240,Árlista!B:I,8,0)","v":150800}]
[null,null,null,4116024265,"PRO A29B 27 CT2  ","Ékszíj, 400V","2 / 1",27,255,2,1.5,1075,"400/3/50 ",10,93,"870x370x780",49,{"$f":"VLOOKUP(D241,Árlista!B:I,8,0)","v":150800}]
[47,null,null,4116024266,"PRO A29B 50 CM2  ","Ékszíj, 230V","2 / 1",50,255,2,1.5,1075,"230/1/50 ",10,93,"870x370x780",49,{"$f":"VLOOKUP(D242,Árlista!B:I,8,0)","v":154300}]
[48,null,null,4116024267,"PRO A29B 50 CT2  ","Ékszíj, 400V","2 / 1",50,255,2,1.5,1075,"400/3/50 ",10,93,"870x370x780",49,{"$f":"VLOOKUP(D243,Árlista!B:I,8,0)","v":154300}]
[49,null,null,4116024568,"PRO A29B 100 CM2","Ékszíj, 230V","2 / 1",100,255,2,1.5,1075,"230/1/50 ",10,93,"1010x415x900",56,{"$f":"VLOOKUP(D244,Árlista!B:I,8,0)","v":172700}]
[50,null,null,4116024569,"PRO A29B 100 CT2","Ékszíj, 400V","2 / 1",100,255,2,1.5,1075,"400/3/50 ",10,93,"1010x415x900",56,{"$f":"VLOOKUP(D245,Árlista!B:I,8,0)","v":172700}]
[51,null,null,4116024536,"PRO A29B 150 CM2  ","Ékszíj, 230V","2 / 1",150,255,2,1.5,1075,"230/1/50 ",10,93,"1375x420x950",87,{"$f":"VLOOKUP(D246,Árlista!B:I,8,0)","v":184900}]
[52,null,null,4116024537,"PRO A29B 150 CT2  ","Ékszíj, 400V","2 / 1",150,255,2,1.5,1075,"400/3/50 ",10,93,"1375x420x950",87,{"$f":"VLOOKUP(D247,Árlista!B:I,8,0)","v":184900}]
[53]
[54]
[]
[]
[]
[]
[]
[]
[null,null,null,"Cikkszám","Model","Leirat","Henger/\nFokozat","Tartály \nl","Szívott \nl/min","Teljes.\nHP","Teljes.\nkW","Ford sz.\nrpm","Volt","Max\nBar","dB(A)","Méret \n(mm)","Tömeg \nkg","Nettó ár"]
[null,null,null,4116024523,"PRO A39B 90 CM3  ","Ékszíj, 230V","2 / 1",90,393,3,2.2000000000000002,1050,"230/1/50 ",10,93,"1180x460x930",72,{"$f":"VLOOKUP(D257,Árlista!B:I,8,0)","v":190800}]
[null,null,null,4116024524,"PRO A39B 90 CT3  ","Ékszíj, 400V","2 / 1",90,393,3,2.2000000000000002,1050,"400/3/50 ",10,93,"1180x460x930",72,{"$f":"VLOOKUP(D258,Árlista!B:I,8,0)","v":190800}]
[55,null,null,4116024278,"PRO A39B 100 CM3  ","Ékszíj, 230V","2 / 1",100,393,3,2.2000000000000002,1050,"230/1/50 ",10,93,"1180x460x930",72,{"$f":"VLOOKUP(D259,Árlista!B:I,8,0)","v":193400}]
[56,null,null,4116024279,"PRO A39B 100 CT3  ","Ékszíj, 400V","2 / 1",100,393,3,2.2000000000000002,1050,"400/3/50 ",10,93,"1180x460x930",72,{"$f":"VLOOKUP(D260,Árlista!B:I,8,0)","v":193400}]
[null,null,null,4116024614,"PRO A39B 90 CT4","Ékszíj, 400V","2 / 1",90,486,4,3,1300,"400/3/50 ",10,93,"1180x460x930",80,{"$f":"VLOOKUP(D261,Árlista!B:I,8,0)","v":196300}]
[null,null,null,4116024280,"PRO A39B 150 CM3  ","Ékszíj, 230V","2 / 1",150,393,3,2.2000000000000002,1050,"230/1/50 ",10,93,"1375x420x950",87,{"$f":"VLOOKUP(D262,Árlista!B:I,8,0)","v":207300}]
[null,null,null,4116024281,"PRO A39B 150 CT3  ","Ékszíj, 400V","2 / 1",150,393,3,2.2000000000000002,1050,"400/3/50 ",10,93,"1375x420x950",87,{"$f":"VLOOKUP(D263,Árlista!B:I,8,0)","v":207300}]
[58,null,null,4116024282,"PRO A39B 200 CM3  ","Ékszíj, 230V","2 / 1",200,393,3,2.2000000000000002,1050,"230/1/50 ",10,93,"1500x470x1110",91,{"$f":"VLOOKUP(D264,Árlista!B:I,8,0)","v":231600}]
[59,null,null,4116024283,"PRO A39B 200 CT3  ","Ékszíj, 400V","2 / 1",200,393,3,2.2000000000000002,1050,"400/3/50 ",10,93,"1500x470x1110",91,{"$f":"VLOOKUP(D265,Árlista!B:I,8,0)","v":231600}]
[60,null,null,4116024285,"PRO A39B 270 CM3  ","Ékszíj, 230V","2 / 1",270,393,3,2.2000000000000002,1050,"230/1/50 ",10,93,"1530x595x1160",98,{"$f":"VLOOKUP(D266,Árlista!B:I,8,0)","v":246200}]
[61,null,null,4116024286,"PRO A39B 270 CT3  ","Ékszíj, 400V","2 / 1",270,393,3,2.2000000000000002,1050,"400/3/50 ",10,93,"1530x595x1160",98,{"$f":"VLOOKUP(D267,Árlista!B:I,8,0)","v":246200}]
[62,null,null,4116024166,"PRO A39B 200 CT4  ","Ékszíj, 400V","2 / 1",200,486,4,3,1300,"400/3/50 ",10,96,"1500x470x1110",91,{"$f":"VLOOKUP(D268,Árlista!B:I,8,0)","v":237000}]
[63,null,null,4116024287,"PRO A39B 270 CT4  ","Ékszíj, 400V","2 / 1",270,486,4,3,1300,"400/3/50 ",10,96,"1530x595x1160",98,{"$f":"VLOOKUP(D269,Árlista!B:I,8,0)","v":254900}]
[]
[]
[]
[]
[]
[]
[]
[]
[null,null,null,"Cikkszám","Model","Leirat","Henger/\nFokozat","Tartály \nl","Szívott \nl/min","Teljes.\nHP","Teljes.\nkW","Ford sz.\nrpm","Volt","Max\nBar","dB(A)","Méret \n(mm)","Tömeg \nkg","Nettó ár"]
[null,null,null,4116000250,"PRO A49B 100 CM3","Ékszíj, 230V, mobil","2 / 2 ",100,444,3,2.2000000000000002,1050,"230/1/50",10,91,"1006x480x927",70,{"$f":"VLOOKUP(D279,Árlista!B:I,8,0)","v":212700}]
[null,null,null,4116000251,"PRO A49B 150 CM3","Ékszíj, 230V, mobil","2 / 2 ",150,444,3,2.2000000000000002,1050,"230/1/50",10,91,"1305x501x1006",84,{"$f":"VLOOKUP(D280,Árlista!B:I,8,0)","v":228100}]
[null,null,null,4116000252,"PRO A49B 200 CM3","Ékszíj, 230V, mobil","2 / 2 ",200,444,3,2.2000000000000002,1050,"230/1/50",10,91,"1437x573x1058",109,{"$f":"VLOOKUP(D281,Árlista!B:I,8,0)","v":254700}]
[null,null,null,4116000253,"PRO A49B 270 FM3","Ékszíj, 230V, mobil","2 / 2 ",270,444,3,2.2000000000000002,1050,"230/1/50",10,91,"1530x595x1160",118,{"$f":"VLOOKUP(D282,Árlista!B:I,8,0)","v":257700}]
[null,null,null,4116000249,"PRO A49B 270 FT3","Ékszíj, 400V, telepít","2 / 2 ",270,444,3,2.2000000000000002,1050,"400/3/50",10,91,"1530x595x1160",118,{"$f":"VLOOKUP(D283,Árlista!B:I,8,0)","v":257700}]
[null,null,null,4116000232,"PRO A49B 100 CT3","Ékszíj, 400V, mobil","2 / 2 ",100,444,3,2.2000000000000002,1050,"400/3/50",10,91,"1006x480x927",70,{"$f":"VLOOKUP(D284,Árlista!B:I,8,0)","v":212700}]
[null,null,null,4116000233,"PRO A49B 150 CT3","Ékszíj, 400V, mobil","2 / 2 ",150,444,3,2.2000000000000002,1050,"400/3/50",10,91,"1305x501x1006",84,{"$f":"VLOOKUP(D285,Árlista!B:I,8,0)","v":228100}]
[null,null,null,4116000234,"PRO A49B 200 CT3","Ékszíj, 400V, mobil","2 / 2 ",200,444,3,2.2000000000000002,1050,"400/3/50",10,91,"1437x573x1058",109,{"$f":"VLOOKUP(D286,Árlista!B:I,8,0)","v":254700}]
[]
[]
[]
[]
[]
[]
[]
[null,null,null,"Cikkszám","Model","Leirat","Henger/\nFokozat","Tartály \nl","Szívott \nl/min","Teljes.\nHP","Teljes.\nkW","Ford sz.\nrpm","Volt","Max\nBar","dB(A)","Méret \n(mm)","Tömeg \nkg","Nettó ár"]
[null,null,null,4116000235,"PRO A49B 200 CT4","Ékszíj, 400V, mobil","2 / 2 ",200,553,4,3,1300,"400/3/50",10,93,"1437x573x1058",105,{"$f":"VLOOKUP(D295,Árlista!B:I,8,0)","v":259200}]
[null,null,null,4116000237,"PRO A49B 270 CT4","Ékszíj, 400V, mobil","2 / 2 ",270,553,4,3,1300,"400/3/50",10,93,"1530x595x1160",120,{"$f":"VLOOKUP(D296,Árlista!B:I,8,0)","v":298700}]
[null,null,null,4116000236,"PRO A49B 200 FT4","Ékszíj, 400V, telepít","2 / 2 ",200,553,4,3,1300,"400/3/50",10,93,"1437x573x1058",105,{"$f":"VLOOKUP(D297,Árlista!B:I,8,0)","v":260800}]
[null,null,null,4116000238,"PRO A49B 270 FT4","Ékszíj, 400V, telepít","2 / 2 ",270,533,4,3,1300,"400/3/50",10,93,"1530x595x1160",120,{"$f":"VLOOKUP(D298,Árlista!B:I,8,0)","v":284600}]
[null,null,null,4116000239,"PRO A49B 200 VT4","Ékszíj, 400V, álló tart","2 / 2 ","200V",533,4,3,1300,"400/3/50",11,93,"850x970x2050",130,{"$f":"VLOOKUP(D299,Árlista!B:I,8,0)","v":360000}]
[]
[]
[]
[]
[]
[null,null,null,"Cikkszám","Model","Leirat","Henger/\nFokozat","Tartály \nl","Szívott \nl/min","Teljes.\nHP","Teljes.\nkW","Ford sz.\nrpm","Volt","Max\nBar","dB(A)","Méret \n(mm)","Tömeg \nkg","Nettó ár"]
[null,null,null,4116000241,"PRO A49B 200 CT5,5","Ékszíj, 400V, mobil","2 / 2 ",200,595,5.5,4,1400,"400/3/50",10,95,"1530x595x1160",114,{"$f":"VLOOKUP(D306,Árlista!B:I,8,0)","v":303700}]
[null,null,null,4116000243,"PRO A49B 270 CT5,5","Ékszíj, 400V, mobil","2 / 2 ",270,595,5.5,4,1400,"400/3/50",10,95,"1500x470x1110",124,{"$f":"VLOOKUP(D307,Árlista!B:I,8,0)","v":311000}]
[null,null,null,4116000245,"PRO A49B 500 CT5,5","Ékszíj, 400V, mobil","2 / 2 ",500,595,5.5,4,1400,"400/3/50",10,95,"2030x670x1400",191,{"$f":"VLOOKUP(D308,Árlista!B:I,8,0)","v":409400}]
[null,null,null,4116000242,"PRO A49B 200 FT5,5","Ékszíj, 400V, telepít","2 / 2 ",200,595,5.5,4,1400,"400/3/50",10,95,"1530x595x1160",114,{"$f":"VLOOKUP(D309,Árlista!B:I,8,0)","v":291200}]
[null,null,null,4116000244,"PRO A49B 270 FT5,5","Ékszíj, 400V, telepít","2 / 2 ",270,595,5.5,4,1400,"400/3/50",10,95,"1500x470x1110",124,{"$f":"VLOOKUP(D310,Árlista!B:I,8,0)","v":299300}]
[null,null,null,4116000246,"PRO A49B 500 FT5,5","Ékszíj, 400V, telepít","2 / 2 ",500,595,5.5,4,1400,"400/3/50",10,95,"2030x670x1400",191,{"$f":"VLOOKUP(D311,Árlista!B:I,8,0)","v":389300}]
[null,null,null,4116000247,"PRO A49B 200 VT5,5","Ékszíj, 400V, álló tart","2 / 2 ","200V",595,5.5,4,1400,"400/3/50",11,95,"850x970x2050",117,{"$f":"VLOOKUP(D312,Árlista!B:I,8,0)","v":364500}]
[null,null,null,4116000248,"PRO A49B 270 VT5,5","Ékszíj, 400V, álló tart","2 / 2 ","270V",595,5.5,4,1400,"400/3/50",11,95,"850x970x2100",138,{"$f":"VLOOKUP(D313,Árlista!B:I,8,0)","v":406800}]
[]
[]
[]
[]
[]
[]
[]
[]
[]
[null,null,null,"Cikkszám","Model","Leirat","Henger/\nFokozat","Tartály \nl","Szívott \nl/min","Teljes.\nHP","Teljes.\nkW","Ford sz.\nrpm","Volt","Max\nBar","dB(A)","Méret \n(mm)","Tömeg \nkg","Nettó ár"]
[null,null,null,4116019571,"PRO B4900 200 CT4  ","Ékszíj, mobil","2 / 2 ",200,514,4,3,1400,"400/3/50 ",11,null,"1500x450x960",140,{"$f":"VLOOKUP(D324,Árlista!B:I,8,0)","v":264400}]
[65,null,null,4116019576,"PRO B4900 200 FT4  ","Ékszíj, telepített","2 / 2 ",200,514,4,3,1400,"400/3/50 ",11,null,"1500x450x960",137,{"$f":"VLOOKUP(D325,Árlista!B:I,8,0)","v":266000}]
[66,null,null,4116019626,"PRO B4900 270 CT4  ","Ékszíj, mobil","2 / 2 ",270,514,4,3,1400,"400/3/50 ",11,null,"1530x600x1160",147,{"$f":"VLOOKUP(D326,Árlista!B:I,8,0)","v":304700}]
[67,null,null,4116019632,"PRO B4900 270 FT4  ","Ékszíj, telepített","2 / 2 ",270,514,4,3,1400,"400/3/50 ",11,null,"1530x600x1160",144,{"$f":"VLOOKUP(D327,Árlista!B:I,8,0)","v":290300}]
[68,null,null,4116019556,"B4900 90 CT4  15bar","Ékszíj, mobil","2 / 2 ",90,370,4,3,896,"400/3/50 ",15,null,"1180x460x930",120,{"$f":"VLOOKUP(D328,Árlista!B:I,8,0)","v":264500}]
[null,null,null,4116019696,"PRO B5900B 200 CT5,5  ","Ékszíj, mobil","2 / 2 ",200,653,5.5,4,1400,"400/3/50 ",11,null,"1580x580x1150",164,{"$f":"VLOOKUP(D329,Árlista!B:I,8,0)","v":333000}]
[69,null,null,4116019700,"PRO B5900B 200 FT5,5  ","Ékszíj, telepített","2 / 2 ",200,653,5.5,4,1400,"400/3/50 ",11,null,"1580x580x1150",161,{"$f":"VLOOKUP(D330,Árlista!B:I,8,0)","v":330000}]
[70,null,null,4116019770,"PRO B5900B 270 CT5,5  ","Ékszíj, mobil","2 / 2 ",270,653,5.5,4,1400,"400/3/50 ",11,null,"1575x680x1150",170,{"$f":"VLOOKUP(D331,Árlista!B:I,8,0)","v":352500}]
[72,null,null,4116019781,"PRO B5900B 270 FT5,5  ","Ékszíj, telepített","2 / 2 ",270,653,5.5,4,1400,"400/3/50 ",11,null,"1575x680x1150",167,{"$f":"VLOOKUP(D332,Árlista!B:I,8,0)","v":328200}]
[73,null,null,4116019806,"PRO B5900B 500 CT5,5  ","Ékszíj, mobil","2 / 2 ",500,653,5.5,4,1400,"400/3/50 ",11,null,"2030x670x1400",222,{"$f":"VLOOKUP(D333,Árlista!B:I,8,0)","v":464000}]
[74,null,null,4116019812,"PRO B5900B 500 FT5,5  ","Ékszíj, telepített","2 / 2 ",500,653,5.5,4,1400,"400/3/50 ",11,null,"2030x670x1400",219,{"$f":"VLOOKUP(D334,Árlista!B:I,8,0)","v":441200}]
[75,null,null,4116020182,"PRO B6000 270 CT7,5  ","Ékszíj, mobil","2 / 2 ",270,827,7.5,5.5,1400,"400/3/50 ",11,null,"1520x600x1250",170,{"$f":"VLOOKUP(D335,Árlista!B:I,8,0)","v":418400}]
[76,null,null,4116020190,"PRO B6000 270 FT7,5  ","Ékszíj, telepített","2 / 2 ",270,827,7.5,5.5,1400,"400/3/50 ",11,null,"1520x600x1250",177,{"$f":"VLOOKUP(D336,Árlista!B:I,8,0)","v":402400}]
[77,null,null,4116020226,"PRO B6000 500 CT7,5  ","Ékszíj, mobil","2 / 2 ",500,827,7.5,5.5,1400,"400/3/50 ",11,null,"2030x670x1400",263,{"$f":"VLOOKUP(D337,Árlista!B:I,8,0)","v":540900}]
[78,null,null,4116020243,"PRO B6000 500 FT7,5  ","Ékszíj, telepített","2 / 2 ",500,827,7.5,5.5,1400,"400/3/50 ",11,null,"2030x670x1400",260,{"$f":"VLOOKUP(D338,Árlista!B:I,8,0)","v":494200}]
[79,null,null,4116020782,"PRO B7000 270 CT10  ","Ékszíj, mobil","2 / 2 ",270,1210,10,7.5,1300,"400/3/50 ",11,null,"1520x600x1250",199,{"$f":"VLOOKUP(D339,Árlista!B:I,8,0)","v":517900}]
[80,null,null,4116020790,"PRO B7000 270 FT10  ","Ékszíj, telepített","2 / 2 ",270,1210,10,7.5,1300,"400/3/50 ",11,null,"1520x600x1250",196,{"$f":"VLOOKUP(D340,Árlista!B:I,8,0)","v":515100}]
[81,null,null,4116020835,"PRO B7000 500 CT10  ","Ékszíj, mobil","2 / 2 ",500,1210,10,7.5,1300,"400/3/50 ",11,null,"2030x670x1400",282,{"$f":"VLOOKUP(D341,Árlista!B:I,8,0)","v":601900}]
[82,null,null,4116020855,"PRO B7000 500 FT10  ","Ékszíj, telepített","2 / 2 ",500,1210,10,7.5,1300,"400/3/50 ",11,null,"2030x670x1400",279,{"$f":"VLOOKUP(D342,Árlista!B:I,8,0)","v":580500}]
[83,null,null,4116020796,"PRO B7000 900 FT10  ","Ékszíj, telepített","2 / 2 ",900,1210,10,7.5,1300,"400/3/50 ",11,null,"2070x800x1570",337,{"$f":"VLOOKUP(D343,Árlista!B:I,8,0)","v":737400}]
[84,null,null,4116020179,"PRO B6000 270 CT5,5  ","Ékszíj, mobil","2 / 2 ",270,660,5.5,4,1100,"400/3/50 ",11,null,"1520x600x1250",171,{"$f":"VLOOKUP(D344,Árlista!B:I,8,0)","v":398500}]
[85,null,null,4116020225,"PRO B6000 500 CT5,5  ","Ékszíj, mobil","2 / 2 ",500,660,5.5,4,1100,"400/3/50 ",11,null,"2030x670x1400",232,{"$f":"VLOOKUP(D345,Árlista!B:I,8,0)","v":498200}]
[86,null,null,4116020242,"PRO B6000 500 FT5,5  ","Ékszíj, telepített","2 / 2 ",500,660,5.5,4,1100,"400/3/50 ",11,null,"2030x670x1400",229,{"$f":"VLOOKUP(D346,Árlista!B:I,8,0)","v":481400}]
[87,null,null,4116020778,"PRO B7000 270 CT7,5  ","Ékszíj, mobil","2 / 2 ",270,1023,7.5,5.5,1100,"400/3/50 ",11,null,"1520x600x1250",194,{"$f":"VLOOKUP(D347,Árlista!B:I,8,0)","v":498200}]
[88,null,null,4116020789,"PRO B7000 270 FT7,5  ","Ékszíj, telepített","2 / 2 ",270,1023,7.5,5.5,1100,"400/3/50 ",11,null,"1520x600x1250",191,{"$f":"VLOOKUP(D348,Árlista!B:I,8,0)","v":481400}]
[89,null,null,4116020834,"PRO B7000 500 CT7,5  ","Ékszíj, mobil","2 / 2 ",500,1023,7.5,5.5,1100,"400/3/50 ",11,null,"2030x670x1400",277,{"$f":"VLOOKUP(D349,Árlista!B:I,8,0)","v":589300}]
[null,null,null,4116020852,"PRO B7000 500 FT7,5  ","Ékszíj, telepített","2 / 2 ",500,1023,7.5,5.5,1100,"400/3/50 ",11,null,"2030x670x1400",274,{"$f":"VLOOKUP(D350,Árlista!B:I,8,0)","v":566700}]
[90,null,null,4116023545,"PRO B7900 500 FT10","Ékszíj, telepített","2 / 2 ",500,1130,10,7.5,900,"400/3/50 ",11,null,"2030x670x1400",274,{"$f":"VLOOKUP(D351,Árlista!B:I,8,0)","v":607900}]
[]
[]
[]
[]
[]
[]
[]
[]
[]
[null,null,null,"Cikkszám","Model","Leirat","Henger/\nFokozat","Tartály \nl","Szívott \nl/min","Teljes.\nHP","Teljes.\nkW","Ford sz.\nrpm","Volt","Max\nBar","dB(A)","Méret \n(mm)","Tömeg \nkg","Nettó ár"]
[91,null,null,4116000158,"B4900 270 FT4 FFO  ","Telepített, hűtvesz.","2 / 2 ",270,514,4,3,1400,"400/3/50 ",11,null,"1490x500x1175",174,{"$f":"VLOOKUP(D362,Árlista!B:I,8,0)","v":568500}]
[92,null,null,4116000159,"B5900B 270 FT5,5 FFO  ","Telepített, hűtvesz.","2 / 2 ",270,653,5.5,4,1400,"400/3/50 ",11,null,"1490x500x1175",197,{"$f":"VLOOKUP(D363,Árlista!B:I,8,0)","v":615500}]
[93,null,null,4116000171,"B5900B 270 FT5,5 FFO YD ","Telepített, hűtvesz.","2 / 2 ",270,653,5.5,4,1400,"400/3/50 YD",11,null,"1490x500x1175",197,{"$f":"VLOOKUP(D364,Árlista!B:I,8,0)","v":723700}]
[94,null,null,4116000165,"B5900B 500 FT5,5 FFO  ","Telepített, hűtvesz.","2 / 2 ",500,653,5.5,4,1400,"400/3/50 ",11,null,"1894x600x1280",249,{"$f":"VLOOKUP(D365,Árlista!B:I,8,0)","v":715600}]
[95,null,null,4116000172,"B5900B 500 FT5,5 FFO YD ","Telepített, hűtvesz.","2 / 2 ",500,653,5.5,4,1400,"400/3/50 YD",11,null,"1894x600x1280",249,{"$f":"VLOOKUP(D366,Árlista!B:I,8,0)","v":823600}]
[96,null,null,4116000166,"B6000 270 FT7,5 FFO  ","Telepített, hűtvesz.","2 / 2 ",270,827,7.5,5.5,1400,"400/3/50 ",11,null,"1490x500x1175",207,{"$f":"VLOOKUP(D367,Árlista!B:I,8,0)","v":735700}]
[97,null,null,4116000173,"B6000 270 FT7,5 FFO YD ","Telepített, hűtvesz.","2 / 2 ",270,827,7.5,5.5,1400,"400/3/50 YD",11,null,"1490x500x1175",207,{"$f":"VLOOKUP(D368,Árlista!B:I,8,0)","v":843800}]
[98,null,null,4116000167,"B6000 500 FT7,5 FFO  ","Telepített, hűtvesz.","2 / 2 ",500,827,7.5,5.5,1400,"400/3/50 ",11,null,"1894x600x1280",290,{"$f":"VLOOKUP(D369,Árlista!B:I,8,0)","v":830300}]
[99,null,null,4116000174,"B6000 500 FT7,5 FFO YD ","Telepített, hűtvesz.","2 / 2 ",500,827,7.5,5.5,1400,"400/3/50 YD",11,null,"1894x600x1280",290,{"$f":"VLOOKUP(D370,Árlista!B:I,8,0)","v":938200}]
[100,null,null,4116000168,"B7000 270 FT10 FFO  ","Telepített, hűtvesz.","2 / 2 ",270,1210,10,7.5,1300,"400/3/50 ",11,null,"1490x500x1175",231,{"$f":"VLOOKUP(D371,Árlista!B:I,8,0)","v":847100}]
[101,null,null,4116000175,"B7000 270 FT10 FFO YD ","Telepített, hűtvesz.","2 / 2 ",270,1210,10,7.5,1300,"400/3/50 YD",11,null,"1490x500x1175",231,{"$f":"VLOOKUP(D372,Árlista!B:I,8,0)","v":955000}]
[102,null,null,4116000169,"B7000 500 FT10 FFO  ","Telepített, hűtvesz.","2 / 2 ",500,1210,10,7.5,1300,"400/3/50 ",11,null,"1894x600x1280",314,{"$f":"VLOOKUP(D373,Árlista!B:I,8,0)","v":941200}]
[103,null,null,4116000176,"B7000 500 FT10 FFO YD ","Telepített, hűtvesz.","2 / 2 ",500,1210,10,7.5,1300,"400/3/50 YD",11,null,"1894x600x1280",314,{"$f":"VLOOKUP(D374,Árlista!B:I,8,0)","v":1049400}]
[]
[]
[]
[]
[]
[]
[]
[]
[]
[]
[null,null,null,"Cikkszám","Model","Leirat","Henger/\nFokozat","Tartály \nl","Szívott \nl/min","Teljes.\nHP","Teljes.\nkW","Ford sz.\nrpm","Volt","Max\nBar","dB(A)","Méret \n(mm)","Tömeg \nkg","Nettó ár"]
[104,null,null,4116024163,"PRO A39B 150 VM3  ","Állótartály","2 / 1",150,393,3,2.2000000000000002,1050,"230/1/50 ",10,null,"850x970x1950",160,{"$f":"VLOOKUP(D386,Árlista!B:I,8,0)","v":270900}]
[105,null,null,4116024162,"PRO A39B 150 VT3  ","Állótartály","2 / 1",150,393,3,2.2000000000000002,1050,"230/1/50 ",10,null,"850x970x1950",160,{"$f":"VLOOKUP(D387,Árlista!B:I,8,0)","v":270900}]
[106,null,null,4116024560,"PRO B4900 150 VT4  ","Állótartály","2 / 2 ",150,514,4,3,1400,"400/3/50 ",11,null,"850x970x1950",180,{"$f":"VLOOKUP(D388,Árlista!B:I,8,0)","v":340900}]
[107,null,null,4116024561,"PRO B4900 200 VT4  ","Állótartály","2 / 2 ",200,514,4,3,1400,"400/3/50 ",11,null,"850x970x2050",185,{"$f":"VLOOKUP(D389,Árlista!B:I,8,0)","v":367200}]
[108,null,null,4116024563,"PRO B5900B 200 VT5,5  ","Állótartály","2 / 2 ",200,653,5.5,4,1400,"400/3/50 ",11,null,"850x970x2050",205,{"$f":"VLOOKUP(D390,Árlista!B:I,8,0)","v":413100}]
[109,null,null,4116017006,"PRO B5900B 270 VT5,5  ","Állótartály","2 / 2 ",270,653,5.5,4,1400,"400/3/50 ",11,null,"850x970x2100",210,{"$f":"VLOOKUP(D391,Árlista!B:I,8,0)","v":461000}]
[110,null,null,4116017001,"PRO B6000 270 VT7,5  ","Állótartály","2 / 2 ",270,827,7.5,5.5,1400,"400/3/50 ",11,null,"850x970x2100",242,{"$f":"VLOOKUP(D392,Árlista!B:I,8,0)","v":538200}]
[111,null,null,4116017002,"PRO B7000 270 VT10  ","Állótartály","2 / 2 ",270,1210,10,7.5,1300,"400/3/50 ",11,null,"850x970x2100",261,{"$f":"VLOOKUP(D393,Árlista!B:I,8,0)","v":583300}]
[]
[]
[]
[]
[]
[]
[]
[]
[]
[null,null,null,"Cikkszám","Model","Leirat","Henger/\nFokozat","Tartály \nl","Szívott \nl/min","Teljes.\nHP","Teljes.\nkW","Ford sz.\nrpm","Volt","Max\nBar","dB(A)","Méret \n(mm)","Tömeg \nkg","Nettó ár"]
[null,null,null,4116025181,"PRO CA1 270 FT5,5","Ékszíj, V4 öntöttvas","2 / 2 ",270,530,5.5,4,688,"400/3/50 ",11,null,"1500x530x1210",214,{"$f":"VLOOKUP(D404,Árlista!B:I,8,0)","v":549300}]
[null,null,null,4116025186,"PRO CA1 500 FT5,5","Ékszíj, V4 öntöttvas","2 / 2 ",500,530,5.5,4,688,"400/3/50 ",11,null,"1920x600x1340",303,{"$f":"VLOOKUP(D405,Árlista!B:I,8,0)","v":628000}]
[null,null,null,4116025182,"PRO CA1 270 FT7,5","Ékszíj, V4 öntöttvas","2 / 2 ",270,699,7.5,5.5,908,"400/3/50 ",11,null,"1500x530x1210",239,{"$f":"VLOOKUP(D406,Árlista!B:I,8,0)","v":581800}]
[null,null,null,4116025183,"PRO CA1 500 FT7,5","Ékszíj, V4 öntöttvas","2 / 2 ",500,699,7.5,5.5,908,"400/3/50 ",11,null,"1920x600x1340",328,{"$f":"VLOOKUP(D407,Árlista!B:I,8,0)","v":662700}]
[null,null,null,4116025185,"PRO CA2 500 FT10","Ékszíj, V4 öntöttvas","4 / 2 ",500,1056,10,7.5,685,"400/3/50 ",11,null,"1920x600x1340",358,{"$f":"VLOOKUP(D408,Árlista!B:I,8,0)","v":698900}]
[null,null,null,4116025190,"PRO CA2 500 FT10 YD","Ékszíj, V4 öntöttvas","4 / 2 ",500,1056,10,7.5,685,"400/3/50  YD",11,null,"1920x600x1340",360,{"$f":"VLOOKUP(D409,Árlista!B:I,8,0)","v":878100}]
[null,null,null,4116025184,"PRO T CA1 500 FT7,5","Tandem, V4 öntöttvas","2 / 2 ",500,1399,"7,5 + 7,5","5,5 + 5,5",908,"400/3/50 ",11,null,"1920x600x1340",488,{"$f":"VLOOKUP(D410,Árlista!B:I,8,0)","v":1150300}]
[]
[]
[]
[]
[]
[]
[]
[]
[]
[]
[]
[]
[]
[null,null,null,"Cikkszám","Model","Leirat","Henger/\nFokozat","Tartály \nl","Szívott \nl/min","Teljes.\nHP","Teljes.\nkW","Ford sz.\nrpm","Volt","Max\nBar","dB(A)","Méret \n(mm)","Tömeg \nkg","Nettó ár"]
[112,null,null,4116023343,"PRO BV8900 900 FT15  ","Ékszíj, 4 hengeres","4 / 2",900,2016,15,11,800,"400/3/50 ",11,null,"2430x930x1170",535,{"$f":"VLOOKUP(D425,Árlista!B:I,8,0)","v":2362900}]
[113,null,null,4116021614,"PRO BV8900 900 FT20  ","Ékszíj, 4 hengeres","4 / 2",900,2400,20,15,950,"400/3/50 ",11,null,"2430x930x1170",584,{"$f":"VLOOKUP(D426,Árlista!B:I,8,0)","v":2420000}]
[114,null,null,4116019643,"PRO B4900 500 T4  ","Tandem","2 / 2 * 2",500,1028,"4+4","3+3",1400,"400/3/50 ",11,null,"2030x670x1300",304,{"$f":"VLOOKUP(D427,Árlista!B:I,8,0)","v":711600}]
[115,null,null,4116019884,"PRO B5900 500 T5,5  ","Tandem","2 / 2 * 2",500,1306,"5,5+5,5","4+4",1400,"400/3/50 ",11,null,"2030x670x1400",323,{"$f":"VLOOKUP(D428,Árlista!B:I,8,0)","v":825800}]
[116,null,null,4116020371,"PRO B6000 500 T5,5  ","Tandem","2 / 2 * 2",500,1320,"5,5+5,5","4+4",1100,"400/3/50 ",11,null,"2030x670x1400",325,{"$f":"VLOOKUP(D429,Árlista!B:I,8,0)","v":910900}]
[117,null,null,4116020375,"PRO B6000 500 T7,5  ","Tandem","2 / 2 * 2",500,1654,"7,5+7,5","5,5+5,5",1400,"400/3/50 ",11,null,"2030x670x1400",387,{"$f":"VLOOKUP(D430,Árlista!B:I,8,0)","v":982300}]
[118,null,null,4116020203,"PRO B6000 900 T7,5  ","Tandem","2 / 2 * 2",900,1654,"7,5+7,5","5,5+5,5",1400,"400/3/50 ",11,null,"2070x800x1570",500,{"$f":"VLOOKUP(D431,Árlista!B:I,8,0)","v":1110100}]
[119,null,null,4116020987,"PRO B7000 500 T7,5  ","Tandem","2 / 2 * 2",500,2046,"7,5+7,5","5,5+5,5",1100,"400/3/50 ",11,null,"2030x670x1400",425,{"$f":"VLOOKUP(D432,Árlista!B:I,8,0)","v":1089000}]
[120,null,null,4116020810,"PRO B7000 900 T10  ","Tandem","2 / 2 * 2",900,2420,"10+10","7,5+7,5",1400,"400/3/50 ",11,null,"2070x800x1570",538,{"$f":"VLOOKUP(D433,Árlista!B:I,8,0)","v":1195700}]
[]
[]
[]
[]
[]
[]
[]
[]
[null,null,null,null,"Nagy nyomású készülékek"]
[]
[null,null,null,"Cikkszám","Model","Leirat","Henger/\nFokozat","Tartály \nl","Szívott \nl/min","Teljes.\nHP","Teljes.\nkW","Ford sz.\nrpm","Volt","Max\nBar","dB(A)","Méret \n(mm)","Tömeg \nkg","Nettó ár"]
[121,null,null,4116019556,"B4900 90 CT4  15bar","Ékszíj, mobil","2 / 2 ",90,370,4,3,896,"400/3/50 ",15,null,"1180x460x930",120,{"$f":"VLOOKUP(D445,Árlista!B:I,8,0)","v":264500}]
[122,null,null,4116019685,"B 5900B/90 CT5 5 DISG.15B ABAC","Ékszíj, mobil","2 / 2 ",90,653,5.5,4,null,"400/3/50 ",15,null,"1180x460x930",160,{"$f":"VLOOKUP(D446,Árlista!B:I,8,0)","v":377500}]
[null,null,null,4116021231,"PRO B6000 270 VT7.5 15B","Ékszíj, álló tartály","2 / 2 ",270,570,7.5,5,null,"400/3/50 ",15,null,"850x970x2100",280,{"$f":"VLOOKUP(D447,Árlista!B:I,8,0)","v":534200}]
[null,null,null,4116020249,"PRO B6000 500 FT7,5 15 bar","Ékszíj, 15 bar","2 / 2",500,570,7.5,5.5,1000,"400/3/50 YD",15,null,"2030x670x1400",290,{"$f":"VLOOKUP(D448,Árlista!B:I,8,0)","v":687600}]
[null,null,null,4116020860,"PRO B7000 500 FT10 15 bar","Ékszíj, 15 bar","2 / 2",500,930,10,7.5,1000,"400/3/50 YD",15,null,"2030x670x1400",305,{"$f":"VLOOKUP(D449,Árlista!B:I,8,0)","v":794200}]
[124,null,null,4116000103,"B6000 BF7,5    ","Palettára szerelt","2 / 2",null,827,7.5,5.5,1400,"400/3/50 ",11,null,"1100x590x800",120,{"$f":"VLOOKUP(D450,Árlista!B:I,8,0)","v":481600}]
[125,null,null,4116000013,"B7000 BF10    ","Palettára szerelt","2 / 2",null,1210,10,7.5,1300,"400/3/50 ",11,null,"1100x640x800",135,{"$f":"VLOOKUP(D451,Árlista!B:I,8,0)","v":430700}]
[126,null,null,4116000018,"B8900 BF15    ","Palettára szerelt","4 / 2",null,2013,15,11,800,"400/3/50 YD",11,null,"1600x720x1000",338,{"$f":"VLOOKUP(D452,Árlista!B:I,8,0)","v":1757600}]
[127,null,null,4116000016,"B8900 BF20    ","Palettára szerelt","4 / 2",null,2400,20,15,950,"400/3/50 YD",11,null,"1600x720x1000",350,{"$f":"VLOOKUP(D453,Árlista!B:I,8,0)","v":1834400}]
[]
[]
[null,null,null,null,"ABAC \nSILENT\nSZÉRIA"]
[]
[]
[]
[]
[]
[]
[null,null,null,"Cikkszám","Model","Leirat","Henger/\nFokozat","Tartály \nl","Szívott \nl/min","Teljes.\nHP","Teljes.\nkW","Ford sz.\nrpm","Volt","Max\nBar","dB(A)","Méret \n(mm)","Tömeg \nkg","Nettó ár"]
[128,null,null,4116007346,"S A29B 90 CM2  ","Mobil, zajcsillapító","2 / 1",90,255,2,1.5,1075,"230/1/50 ",10,89,"1010x415x980",59,{"$f":"VLOOKUP(D464,Árlista!B:I,8,0)","v":213100}]
[129,null,null,4116007347,"S A29B 90 CT2  ","Mobil, zajcsillapító","2 / 1",90,255,2,1.5,1075,"400/3/50 ",10,90,"1010x415x980",59,{"$f":"VLOOKUP(D465,Árlista!B:I,8,0)","v":213100}]
[130,null,null,4116007348,"S A29B 150 CM2  ","Mobil, zajcsillapító","2 / 1",150,255,2,1.5,1075,"230/1/50 ",10,89,"1375x420x1030",90,{"$f":"VLOOKUP(D466,Árlista!B:I,8,0)","v":230900}]
[131,null,null,4116007349,"S A29B 150 CT2  ","Mobil, zajcsillapító","2 / 1",150,255,2,1.5,1075,"400/3/50 ",10,90,"1375x420x1030",90,{"$f":"VLOOKUP(D467,Árlista!B:I,8,0)","v":230900}]
[132,null,null,4116007350,"S A39B 150 CM3  ","Mobil, zajcsillapító","2 / 1",150,393,3,2.2000000000000002,1050,"230/1/50 ",10,91,"1375x420x1030",90,{"$f":"VLOOKUP(D468,Árlista!B:I,8,0)","v":266200}]
[133,null,null,4116007351,"S A39B 150 CT3  ","Mobil, zajcsillapító","2 / 1",150,393,3,2.2000000000000002,1050,"400/3/50 ",10,91,"1375x420x1030",90,{"$f":"VLOOKUP(D469,Árlista!B:I,8,0)","v":266200}]
[134,null,null,4116007352,"S A39B 200 CM3  ","Mobil, zajcsillapító","2 / 1",200,393,3,2.2000000000000002,1050,"230/1/50 ",10,91,"1500x470x1190",94,{"$f":"VLOOKUP(D470,Árlista!B:I,8,0)","v":288600}]
[135,null,null,4116007353,"S A39B 200 CT3  ","Mobil, zajcsillapító","2 / 1",200,393,3,2.2000000000000002,1050,"400/3/50 ",10,91,"1500x470x1190",94,{"$f":"VLOOKUP(D471,Árlista!B:I,8,0)","v":288600}]
[136,null,null,4116007354,"S A39B 270 CM3  ","Mobil, zajcsillapító","2 / 1",270,393,3,2.2000000000000002,1050,"230/1/50 ",10,91,"1530x595x1140",141,{"$f":"VLOOKUP(D472,Árlista!B:I,8,0)","v":307300}]
[137,null,null,4116007355,"S A39B 270 CT3  ","Mobil, zajcsillapító","2 / 1",270,393,3,2.2000000000000002,1050,"400/3/50 ",10,91,"1530x595x1140",141,{"$f":"VLOOKUP(D473,Árlista!B:I,8,0)","v":307300}]
[138,null,null,4116007356,"S A39B 200 CT4  ","Mobil, zajcsillapító","2 / 1",200,486,4,3,1300,"400/3/50 ",10,94,"1500x470x1190",94,{"$f":"VLOOKUP(D474,Árlista!B:I,8,0)","v":305100}]
[139,null,null,4116007357,"S A39B 270 CT4  ","Mobil, zajcsillapító","2 / 1",270,486,4,3,1300,"400/3/50 ",10,94,"1530x595x1140",141,{"$f":"VLOOKUP(D475,Árlista!B:I,8,0)","v":317900}]
[]
[]
[]
[]
[]
[]
[]
[]
[]
[]
[]
[null,null,null,"Cikkszám","Model","Leirat","Henger/\nFokozat","Tartály \nl","Szívott \nl/min","Teljes.\nHP","Teljes.\nkW","Ford sz.\nrpm","Volt","Max\nBar","dB(A)","Méret \n(mm)","Tömeg \nkg","Nettó ár"]
[140,null,null,4116007332,"S B4900 270 FT4  ","Telepített, zajcsill.","2 / 2",270,425,4,3,1200,"400/3/50 ",11,89,"1500x1200x660",154,{"$f":"VLOOKUP(D488,Árlista!B:I,8,0)","v":506500}]
[141,null,null,4116007333,"S B5900B 270 FT5,5  ","Telepített, zajcsill.","2 / 2",270,525,5.5,4,1100,"400/3/50 ",11,91,"1500x1200x660",177,{"$f":"VLOOKUP(D489,Árlista!B:I,8,0)","v":571600}]
[142,null,null,4116007335,"S B5900B 270 VT5,5  ","Telepített, zajcsill.","2 / 2",270,525,5.5,4,1100,"400/3/51 ",12,91,"1060x700x1900",230,{"$f":"VLOOKUP(D490,Árlista!B:I,8,0)","v":776900}]
[143,null,null,4116007334,"S B5900B 500 FT5,5  ","Telepített, zajcsill.","2 / 2",500,525,5.5,4,1100,"400/3/50 ",11,91,"1900x700x1320",229,{"$f":"VLOOKUP(D491,Árlista!B:I,8,0)","v":717800}]
[144,null,null,4116007336,"S B6000 270 FT7,5  ","Telepített, zajcsill.","2 / 2",270,660,7.5,5.5,1150,"400/3/50 ",11,97,"1500x1200x660",187,{"$f":"VLOOKUP(D492,Árlista!B:I,8,0)","v":667400}]
[145,null,null,4116007338,"S B6000 270 VT7,5  ","Telepített, zajcsill.","2 / 2",270,660,7.5,5.5,1150,"400/3/50 ",11,97,"1060x700x1900",250,{"$f":"VLOOKUP(D493,Árlista!B:I,8,0)","v":846200}]
[146,null,null,4116007337,"S B6000 500 FT7,5  ","Telepített, zajcsill.","2 / 2",500,660,7.5,5.5,1150,"400/3/50 ",11,97,"1900x700x1320",270,{"$f":"VLOOKUP(D494,Árlista!B:I,8,0)","v":818100}]
[]
[]
[]
[]
[]
[]
[]
[]
[]
[]
[null,null,null,"Cikkszám","Model","Leirat","Henger/\nFokozat","Tartály \nl","Szívott \nl/min","Teljes.\nHP","Teljes.\nkW","Ford sz.\nrpm","Volt","Max\nBar","dB(A)","Méret \n(mm)","Tömeg \nkg","Nettó ár"]
[147,null,null,4116074036,"A29B LN M2   ","Zajcsill. doboz","2 / 1",27,255,2,1.5,1075,"230/1/50 ",10,81,"780x470x960",86,{"$f":"VLOOKUP(D506,Árlista!B:I,8,0)","v":315300}]
[148,null,null,4116074037,"A29B LN T2   ","Zajcsill. doboz","2 / 1",27,255,2,1.5,1075,"400/3/50 ",10,81,"780x470x960",86,{"$f":"VLOOKUP(D507,Árlista!B:I,8,0)","v":315300}]
[149,null,null,4116074041,"A29B LN M3   ","Zajcsill. doboz","2 / 1",27,320,3,2.2000000000000002,1350,"230/1/50 ",10,82,"780x470x960",87,{"$f":"VLOOKUP(D508,Árlista!B:I,8,0)","v":338200}]
[150,null,null,4116074039,"A29B LN T3   ","Zajcsill. doboz","2 / 1",27,320,3,2.2000000000000002,1350,"400/3/50 ",10,82,"780x470x960",87,{"$f":"VLOOKUP(D509,Árlista!B:I,8,0)","v":338200}]
[151,null,null,4116007011,"B4900 LN T4   ","Zajcsill. doboz","2 / 2",0,425,4,3,1200,"400/3/50 ",11,85,"945x760x960",170,{"$f":"VLOOKUP(D510,Árlista!B:I,8,0)","v":563300}]
[152,null,null,4116007012,"B5900 LN T5,5   ","Zajcsill. doboz","2 / 2",0,570,5.5,4,1200,"400/3/50 ",11,87,"945x760x960",177,{"$f":"VLOOKUP(D511,Árlista!B:I,8,0)","v":631900}]
[153,null,null,4116007014,"B5900 LN T5,5   ","Zajcsill. doboz","2 / 2",0,570,5.5,4,1200,"400/3/50 YD",11,87,"945x760x960",181,{"$f":"VLOOKUP(D512,Árlista!B:I,8,0)","v":741800}]
[154,null,null,4116007015,"B6000 LN T 7,5  ","Zajcsill. doboz","2 / 2",0,660,7.5,5.5,1150,"400/3/50 ",12,89,"1270x780x890",234,{"$f":"VLOOKUP(D513,Árlista!B:I,8,0)","v":747900}]
[155,null,null,4116007016,"B6000 LN T 7,5  ","Zajcsill. doboz","2 / 2",0,660,7.5,5.5,1150,"400/3/50 YD",12,89,"1270x780x890",240,{"$f":"VLOOKUP(D514,Árlista!B:I,8,0)","v":816800}]
[156,null,null,4116007017,"B7000 LN T 10  ","Zajcsill. doboz","2 / 2",0,1050,10,7.5,1150,"400/3/50 ",12,91,"1270x780x890",253,{"$f":"VLOOKUP(D515,Árlista!B:I,8,0)","v":891100}]
[157,null,null,4116007018,"B7000 LN T 10  ","Zajcsill. doboz","2 / 2",0,1050,10,7.5,1150,"400/3/50 YD",12,91,"1270x780x890",259,{"$f":"VLOOKUP(D516,Árlista!B:I,8,0)","v":1002500}]
[]
[]
[]
[]
[]
[]
[]
[]
[]
[]
[]
[]
[null,null,null,"Cikkszám","Model","Leirat","Henger/\nFokozat","Tartály \nl","Szívott \nl/min","Teljes.\nHP","Teljes.\nkW","Ford sz.\nrpm","Volt","Max\nBar","dB(A)","Méret \n(mm)","Tömeg \nkg","Nettó ár"]
[158,null,null,4116007010,"B4900 LN 270 4  ","Zajcsill dob+tartály","2 / 2",270,425,4,3,1200,"400/3/50 ",11,85,"1600x630x1530",238,{"$f":"VLOOKUP(D530,Árlista!B:I,8,0)","v":728500}]
[159,null,null,4116007001,"B5900 LN 270 5,5  ","Zajcsill dob+tartály","2 / 2",270,570,5.5,4,1200,"400/3/50 ",11,87,"1600x630x1530",248,{"$f":"VLOOKUP(D531,Árlista!B:I,8,0)","v":750800}]
[160,null,null,4116007002,"B5900 LN 270 5,5  ","Zajcsill dob+tartály","2 / 2",270,570,5.5,4,1200,"400/3/50 YD",11,87,"1600x630x1530",252,{"$f":"VLOOKUP(D532,Árlista!B:I,8,0)","v":862100}]
[161,null,null,4116007003,"B5900 LN 500 5,5  ","Zajcsill dob+tartály","2 / 2",500,570,5.5,4,1200,"400/3/50 ",11,87,"2020x1000x1600",302,{"$f":"VLOOKUP(D533,Árlista!B:I,8,0)","v":794500}]
[162,null,null,4116007004,"B5900 LN 500 5,5  ","Zajcsill dob+tartály","2 / 2",500,570,5.5,4,1200,"400/3/50 YD",11,87,"2020x1000x1600",306,{"$f":"VLOOKUP(D534,Árlista!B:I,8,0)","v":905700}]
[163,null,null,4116007005,"B6000 LN 500 7,5  ","Zajcsill dob+tartály","2 / 2",500,660,7.5,5.5,1150,"400/3/50 ",11,88,"2020x1000x1600",404,{"$f":"VLOOKUP(D535,Árlista!B:I,8,0)","v":1007300}]
[164,null,null,4116007006,"B6000 LN 500 7,5  ","Zajcsill dob+tartály","2 / 2",500,660,7.5,5.5,1150,"400/3/50 YD",11,88,"2020x1000x1600",410,{"$f":"VLOOKUP(D536,Árlista!B:I,8,0)","v":1035000}]
[165,null,null,4116007007,"B7000 LN 500 10  ","Zajcsill dob+tartály","2 / 2",500,1050,10,7.5,1150,"400/3/50 ",11,89,"2020x1000x1600",442,{"$f":"VLOOKUP(D537,Árlista!B:I,8,0)","v":1055800}]
[166,null,null,4116007008,"B7000 LN 500 10  ","Zajcsill dob+tartály","2 / 2",500,1050,10,7.5,1150,"400/3/50 YD",11,89,"2020x1000x1600",448,{"$f":"VLOOKUP(D538,Árlista!B:I,8,0)","v":1074100}]
[167,null,null,4116007040,"B5900 LN 500 T 5,5 DRY","….+ Hűtveszárító","2 / 2",500,653,5.5,4,1370,"400/3/50 ",11,87,"2020x1000x1600",302,{"$f":"VLOOKUP(D539,Árlista!B:I,8,0)","v":1155800}]
[168,null,null,4116007041,"B5900 LN 500 T 5,5 DRY","….+ Hűtveszárító","2 / 2",500,653,5.5,4,1370,"400/3/50 YD",11,87,"2020x1000x1600",306,{"$f":"VLOOKUP(D540,Árlista!B:I,8,0)","v":1264900}]
[169,null,null,4116007042,"B6000 LN 500 T 7,5 DRY","….+ Hűtveszárító","2 / 2",500,827,7.5,5.5,1400,"400/3/50 ",11,89,"2020x1000x1600",404,{"$f":"VLOOKUP(D541,Árlista!B:I,8,0)","v":1225900}]
[170,null,null,4116007043,"B6000 LN 500 T 7,5 DRY","….+ Hűtveszárító","2 / 2",500,827,7.5,5.5,1400,"400/3/50 YD",11,89,"2020x1000x1600",410,{"$f":"VLOOKUP(D542,Árlista!B:I,8,0)","v":1334500}]
[171,null,null,4116007044,"B7000 LN 500 T 10 DRY","….+ Hűtveszárító","2 / 2",500,1210,10,7.5,1300,"400/3/50 ",11,91,"2020x1000x1600",442,{"$f":"VLOOKUP(D543,Árlista!B:I,8,0)","v":1443700}]
[172,null,null,4116007045,"B7000 LN 500 T 10 DRY","….+ Hűtveszárító","2 / 2",500,1210,10,7.5,1300,"400/3/50 YD",11,91,"2020x1000x1600",448,{"$f":"VLOOKUP(D544,Árlista!B:I,8,0)","v":1551000}]
[]
[]
[]
[]
[]
[]
[]
[]
[]
[]
[]
[]
[]
[]
[]
[null,null,null,"Cikkszám","Model","Leirat","Henger/\nFokozat","Tartály \nl","Szívott \nl/min","Teljes.\nHP","Teljes.\nkW","Ford sz.\nrpm","Volt","Max\nBar","dB(A)","Méret \n(mm)","Tömeg \nkg","Nettó ár"]
[null,null,null,4116092295,"SLN 270 FT4","NS29S","2 / 2",270,476,4,3,1346,"400/3/50 ",11,76,"1600x550x1055",165,{"$f":"VLOOKUP(D561,Árlista!B:I,8,0)","v":594500}]
[null,null,null,4116092297,"SLN 270 FT4 15B","NS29S","2 / 2",270,331,4,3,null,"400/3/50 ",15,76,"1600x550x1055",170,{"$f":"VLOOKUP(D562,Árlista!B:I,8,0)","v":667400}]
[null,null,null,4116092296,"SLN 270V FT4","NS29S","2 / 2","270V",476,4,3,1346,"400/3/50 ",11,76,"1050X700X1950",180,{"$f":"VLOOKUP(D563,Árlista!B:I,8,0)","v":681900}]
[null,null,null,4116092298,"SLN 270 FT5,5","NS39","2 / 2",270,660,5.5,4,1018,"400/3/50 ",11,72,"1650x620x1250",206,{"$f":"VLOOKUP(D564,Árlista!B:I,8,0)","v":740100}]
[null,null,null,4116092304,"SLN 270 FT5,5 15B","NS39","2 / 2",270,505,5.5,4,null,"400/3/50 ",15,72,"1650x620x1250",215,{"$f":"VLOOKUP(D565,Árlista!B:I,8,0)","v":813300}]
[null,null,null,4116092299,"SLN 270 FT5,5 YD","NS39","2 / 2",270,660,5.5,4,1018,"400/3/50 YD",11,72,"1650x620x1250",218,{"$f":"VLOOKUP(D566,Árlista!B:I,8,0)","v":915800}]
[null,null,null,4116092305,"SLN 270 FT5,5 15B YD","NS39","2 / 2",270,505,5.5,4,null,"400/3/50 YD",15,72,"1650x620x1250",220,{"$f":"VLOOKUP(D567,Árlista!B:I,8,0)","v":985700}]
[null,null,null,4116092301,"SLN 270V FT5,5","NS39","2 / 2","270V",660,5.5,4,1018,"400/3/50 ",11,72,"1050X700X1950",243,{"$f":"VLOOKUP(D568,Árlista!B:I,8,0)","v":832300}]
[null,null,null,4116092306,"SLN 270V FT5,5 15B","NS39","2 / 2","270V",505,5.5,4,null,"400/3/50 ",15,72,"1050X700X1950",250,{"$f":"VLOOKUP(D569,Árlista!B:I,8,0)","v":866500}]
[null,null,null,4116092302,"SLN 500 FT5,5","NS39","2 / 2",500,660,5.5,4,1018,"400/3/50 ",11,72,"2000x670x1350",297,{"$f":"VLOOKUP(D570,Árlista!B:I,8,0)","v":817800}]
[null,null,null,4116092303,"SLN 500 FT5,5 YD","NS39","2 / 2",500,660,5.5,4,1018,"400/3/50 YD",11,72,"2000x670x1350",300,{"$f":"VLOOKUP(D571,Árlista!B:I,8,0)","v":991300}]
[null,null,null,4116092307,"SLN 270V FT7,5","NS59","2 / 2","270V",784,7.5,5.5,622,"400/3/50 ",11,72,"1050X700X1950",250,{"$f":"VLOOKUP(D572,Árlista!B:I,8,0)","v":941700}]
[null,null,null,4116092308,"SLN 500 FT7,5","NS59","2 / 2",500,784,7.5,5.5,622,"400/3/50 ",11,72,"2000x670x1350",300,{"$f":"VLOOKUP(D573,Árlista!B:I,8,0)","v":945600}]
[null,null,null,4116092310,"SLN 500 FT7,5 15B","NS59","2 / 2",500,697,7.5,5.5,null,"400/3/50 ",15,72,"2000x670x1350",310,{"$f":"VLOOKUP(D574,Árlista!B:I,8,0)","v":996800}]
[null,null,null,4116092309,"SLN 500 FT7,5 YD","NS59","2 / 2",500,784,7.5,5.5,622,"400/3/50 YD",11,72,"2000x670x1350",305,{"$f":"VLOOKUP(D575,Árlista!B:I,8,0)","v":1111800}]
[null,null,null,4116092311,"SLN 500 FT7,5 15B YD","NS59","2 / 2",500,697,7.5,5.5,null,"400/3/50 YD",15,72,"2000x670x1350",312,{"$f":"VLOOKUP(D576,Árlista!B:I,8,0)","v":1162800}]

{"sheet":"ABAC CleanAir","index":3,"n_rows":77,"n_cols":18,"rows_kept":77,"cut":false,"hidden":false,"merged":[]}
[null,"TARTALOM"]
[null,"Árlista"]
[null,"Megrendelő"]
[null,"ABAC dugattyús kompresszorok"]
[null,"ABAC CleanAir fogászati kompresszor"]
[null,"AGRE ipari dugattyús kompresszorok"]
[null,"ALUP SONETTO csavarkomp 2,2-15kW"]
[null,"ALUP SCK csavarkomp 4-75kW"]
[null,"ALUP LARGO, ALLEGRO csavarkompr"]
[null,"ALUP Hűtveszárítók"]
[null,"ALUP szűrők"]
[null,"ALUP SpiralAir -Scroll kompresszor"]
[null,"ALUP dugattyús kompresszorok"]
[null,"OMEGA vonali szűrők"]
[null,"OMEGA ciklonszűrők"]
[null,"OMEGA olaj-víz szétválasztók"]
[null,"ABAC sűrítők"]
[null,"CONDOR nyomáskapcsolók"]
[null,"Tartályok"]
[null,"Egyéb alaktrészek"]
[]
[]
[]
[]
[]
[]
[]
[]
[]
[]
[null,null,null,null,null,null,null,null,null,null,null,null,null,null,null,4116092255,"CLR 15/25",{"$f":"VLOOKUP(P31,Árlista!B:I,3,0)","v":"204 000,-Ft "}]
[null,null,null,null,null,null,null,null,null,null,null,null,null,null,null,4116092256,"CLR 15/25 T",{"$f":"VLOOKUP(P32,Árlista!B:I,3,0)","v":"411 400,-Ft "}]
[null,null,null,null,null,null,null,null,null,null,null,null,null,null,null,4116092259,"CLR 15/50",{"$f":"VLOOKUP(P33,Árlista!B:I,3,0)","v":"217 600,-Ft "}]
[null,null,null,null,null,null,null,null,null,null,null,null,null,null,null,4116092260,"CLR 15/50 T",{"$f":"VLOOKUP(P34,Árlista!B:I,3,0)","v":"431 800,-Ft "}]
[null,null,null,null,null,null,null,null,null,null,null,null,null,null,null,4116092257,"CLR 20/25",{"$f":"VLOOKUP(P35,Árlista!B:I,3,0)","v":"241 400,-Ft "}]
[null,null,null,null,null,null,null,null,null,null,null,null,null,null,null,4116092258,"CLR 20/25 T",{"$f":"VLOOKUP(P36,Árlista!B:I,3,0)","v":"448 800,-Ft "}]
[null,null,null,null,null,null,null,null,null,null,null,null,null,null,null,4116092261,"CLR 20/50",{"$f":"VLOOKUP(P37,Árlista!B:I,3,0)","v":"251 600,-Ft "}]
[null,null,null,null,null,null,null,null,null,null,null,null,null,null,null,4116092262,"CLR 20/50 T",{"$f":"VLOOKUP(P38,Árlista!B:I,3,0)","v":"472 600,-Ft "}]
[null,null,null,null,null,null,null,null,null,null,null,null,null,null,null,4116092289,"CLR 25/50",{"$f":"VLOOKUP(P39,Árlista!B:I,3,0)","v":"489 600,-Ft "}]
[null,null,null,null,null,null,null,null,null,null,null,null,null,null,null,4116092290,"CLR 25/50  T",{"$f":"VLOOKUP(P40,Árlista!B:I,3,0)","v":"595 000,-Ft "}]
[null,null,null,null,null,null,null,null,null,null,null,null,null,null,null,4116092267,"CLR 15/30 S",{"$f":"VLOOKUP(P41,Árlista!B:I,3,0)","v":"435 200,-Ft "}]
[null,null,null,null,null,null,null,null,null,null,null,null,null,null,null,4116092268,"CLR 15/30 S T",{"$f":"VLOOKUP(P42,Árlista!B:I,3,0)","v":"612 000,-Ft "}]
[null,null,null,null,null,null,null,null,null,null,null,null,null,null,null,4116092269,"CLR 20/30 S",{"$f":"VLOOKUP(P43,Árlista!B:I,3,0)","v":"472 600,-Ft "}]
[null,null,null,null,null,null,null,null,null,null,null,null,null,null,null,4116092270,"CLR 20/30 S T",{"$f":"VLOOKUP(P44,Árlista!B:I,3,0)","v":"646 000,-Ft "}]
[null,null,null,null,"T -membrán szűrő és szárító -40°C harmatpont",null,null,null,"S -zajcsillapító burkolat"]
[]
[]
[]
[]
[]
[]
[]
[]
[]
[]
[]
[]
[]
[]
[]
[]
[]
[]
[]
[]
[]
[]
[]
[]
[]
[null,null,null,"Cikkszám","Model","Leirat","Henger/\nFokozat","Tartály \nl","FAD. \nl/min","Teljes.\nHP","Teljes.\nkW","Ford sz.\nrpm","Volt","Max\nBar","dB(A)","Méret \n(mm)","Tömeg \nkg","Nettó ár"]
[null,null,null,8115465687,"CNR 75","Direkt hajtás LZT10","2 / 1",null,660,7.5,5.5,null,"400/3/50",10,71,"1442x808x871",244,{"$f":"VLOOKUP(D72,Árlista!B:P,3,0)","v":"9 370,-€ "}]
[null,null,null,8115465695,"CNR 75-270","Direkt hajtás LZT10","2 / 1",270,660,7.5,5.5,null,"400/3/50",10,71,"1752x808x1315",319,{"$f":"VLOOKUP(D73,Árlista!B:P,3,0)","v":"12 150,-€ "}]
[null,null,null,8115465703,"CNR 75-500","Direkt hajtás LZT10","2 / 1",500,660,7.5,5.5,null,"400/3/50",10,71,"1984x808x1457",364,{"$f":"VLOOKUP(D74,Árlista!B:P,3,0)","v":"12 770,-€ "}]
[null,null,null,8115475439,"CNR 100","Direkt hajtás LZT10","2 / 1",null,930,10,7.5,null,"400/3/50",10,74,"1442x808x871",256,{"$f":"VLOOKUP(D75,Árlista!B:P,3,0)","v":"10 710,-€ "}]
[null,null,null,8115475462,"CNR 100-270","Direkt hajtás LZT10","2 / 1",270,930,10,7.5,null,"400/3/50",10,74,"1752x808x1315",331,{"$f":"VLOOKUP(D76,Árlista!B:P,3,0)","v":"14 320,-€ "}]
[null,null,null,8115475496,"CNR 100-500","Direkt hajtás LZT10","2 / 1",500,930,10,7.5,null,"400/3/50",10,74,"1984x808x1457",371,{"$f":"VLOOKUP(D77,Árlista!B:P,3,0)","v":"14 940,-€ "}]

{"sheet":"ALUP szűrő","index":4,"n_rows":43,"n_cols":68,"rows_kept":43,"cut":false,"hidden":false,"merged":[[21,24,21,26],[21,27,21,29],[21,30,21,32],[21,33,21,35],[21,36,21,38],[21,39,21,41],[20,3,20,21],[20,22,20,40],[20,41,20,62],[21,3,21,5],[21,6,21,8],[21,9,21,11],[21,12,21,14],[21,15,21,17],[21,18,21,20],[21,21,21,23],[22,57,22,62],[23,3,23,8],[23,9,23,20],[23,21,23,26],[23,27,23,32],[23,33,23,50],[23,51,23,56],[23,57,23,62],[21,60,21,62],[22,3,22,8],[22,9,22,14],[22,15,22,20],[22,21,22,26],[22,27,22,32],[22,33,22,38],[22,39,22,44],[22,45,22,50],[22,51,22,56],[21,42,21,44],[21,45,21,47],[21,48,21,50],[21,51,21,53],[21,54,21,56],[21,57,21,59],[24,39,24,44],[24,45,24,50],[24,51,24,56],[24,57,24,62],[25,3,25,8],[25,9,25,14],[25,15,25,20],[25,21,25,26],[25,27,25,32],[25,33,25,38],[24,3,24,8],[24,9,24,14],[24,15,24,20],[24,21,24,26],[24,27,24,32],[24,33,24,38],[25,39,25,44],[25,45,25,50],[25,51,25,56],[25,57,25,62],[31,3,31,16],[31,17,31,21],[26,57,26,62],[29,3,29,8],[29,9,29,14],[29,15,29,20],[29,21,29,26],[29,27,29,32],[29,33,29,38],[29,39,29,44],[29,45,29,50],[29,51,29,56],[29,57,29,62],[26,3,26,8],[26,9,26,14],[26,15,26,20],[26,21,26,26],[26,27,26,32],[26,33,26,38],[26,39,26,44],[26,45,26,50],[26,51,26,56],[31,23,31,36],[31,38,31,41],[34,24,34,26],[34,27,34,29],[34,47,34,49],[34,50,34,52],[34,53,34,55],[34,56,34,58],[34,59,34,62],[34,41,34,43],[34,44,34,46],[34,30,34,32],[34,33,34,35],[34,36,34,37],[34,38,34,40],[31,44,31,57],[35,41,35,52],[35,53,35,62],[36,3,36,14],[36,15,36,20],[36,21,36,26],[36,27,36,32],[36,33,36,40],[36,41,36,52],[36,53,36,62],[35,3,35,14],[35,15,35,20],[35,21,35,26],[35,27,35,32],[35,33,35,40],[31,59,31,62],[33,3,33,62],[34,3,34,5],[34,6,34,8],[34,9,34,11],[34,12,34,14],[34,15,34,17],[34,18,34,20],[34,21,34,23],[39,53,39,62],[40,3,40,14],[40,15,40,20],[40,21,40,26],[40,27,40,32],[40,33,40,40],[40,41,40,52],[40,53,40,62],[39,3,39,14],[39,15,39,20],[39,21,39,26],[39,27,39,32],[39,33,39,40],[39,41,39,52],[41,53,41,62],[42,3,42,14],[42,15,42,20],[42,21,42,26],[42,27,42,32],[42,33,42,40],[42,41,42,52],[42,53,42,62],[41,3,41,14],[41,15,41,20],[41,21,41,26],[41,27,41,32],[41,33,41,40],[41,41,41,52]]}
["TARTALOM"]
["Árlista"]
["Megrendelő"]
["ABAC dugattyús kompresszorok"]
["ABAC CleanAir fogászati kompresszor"]
["AGRE ipari dugattyús kompresszorok"]
["ALUP SONETTO csavarkomp 2,2-15kW"]
["ALUP SCK csavarkomp 4-75kW"]
["ALUP LARGO, ALLEGRO csavarkompr"]
["ALUP Hűtveszárítók"]
["ALUP szűrők"]
["ALUP SpiralAir -Scroll kompresszor"]
["ALUP dugattyús kompresszorok"]
["OMEGA vonali szűrők"]
["OMEGA ciklonszűrők"]
["OMEGA olaj-víz szétválasztók"]
["ABAC sűrítők"]
["CONDOR nyomáskapcsolók"]
["Tartályok"]
["Egyéb alaktrészek"]
[null,null,"VONALI SZŰRŐK","S -előszűrő szilárd szennyeződésekhez\nG -előszűrő szilárd és olajaeroszol szennyeződésekhez",null,null,null,null,null,null,null,null,null,null,null,null,null,null,null,null,null,null,"D -utószűrő szilárd szennyeződésekhez\nC -utószűrő szilárd és olajaeroszol szennyeződésekhez",null,null,null,null,null,null,null,null,null,null,null,null,null,null,null,null,null,null,"P -durva szűrő szilárd szennyeződésekhez        \nV -aktívszén szűrő olajköd szűréséhez"]
[null,null,"Méret","A0",null,null,"A1",null,null,"A2",null,null,"A3",null,null,"A4",null,null,"A5",null,null,"A6",null,null,"A7",null,null,"A8",null,null,"A9",null,null,"A10",null,null,"A11",null,null,"A12",null,null,"A13",null,null,"A14",null,null,"A15",null,null,"A16",null,null,"A18",null,null,"A19",null,null,"A21"]
[null,null,"Típus\nNévl. teljesítm. [m3/h]","S-D-G-C-P-V\n45",null,null,null,null,null,"S-D-G-C-P-V\n90",null,null,null,null,null,"S-D-G-C-P-V\n125",null,null,null,null,null,"S-D-G-C-P-V\n180",null,null,null,null,null,"S-D-G-C-P-V\n290",null,null,null,null,null,"S-D-G-C-P-V\n505",null,null,null,null,null,"S-D-G-C-P-V\n685",null,null,null,null,null,"S-D-G-C-P-V\n935",null,null,null,null,null,"S-D-G-C-P-V\n1295",null,null,null,null,null,"S-D-G-C-P-V\n1890"]
[null,null,"Levegőcsatlakozás","3/8\"",null,null,null,null,null,"1/2\"",null,null,null,null,null,null,null,null,null,null,null,"3/4\" / 1\"",null,null,null,null,null,"1\"",null,null,null,null,null,"1 1/2\"",null,null,null,null,null,null,null,null,null,null,null,null,null,null,null,null,null,"2\" / 2 1/2\"",null,null,null,null,null,"3\""]
[null,null,"Méret [a x b x c]","90 x 21 x 228",null,null,null,null,null,"90 x 21 x 228",null,null,null,null,null,"90 x 21 x 228",null,null,null,null,null,"110 x 27,5 x 303",null,null,null,null,null,"110 x 27,5 x 343",null,null,null,null,null,"140 x 34 x 449",null,null,null,null,null,"140 x 34 x 532",null,null,null,null,null,"140 x 34 x 532",null,null,null,null,null,"179 x 50 x 618",null,null,null,null,null,"210 x 57 x 720"]
[null,null,"Tömeg [kg]",1,null,null,null,null,null,1.1000000000000001,null,null,null,null,null,1.3,null,null,null,null,null,1.9,null,null,null,null,null,2.1,null,null,null,null,null,4.2,null,null,null,null,null,4.5,null,null,null,null,null,4.5999999999999996,null,null,null,null,null,6.9,null,null,null,null,null,11]
[null,null,"Méret szereléshez [d]",75,null,null,null,null,null,75,null,null,null,null,null,75,null,null,null,null,null,75,null,null,null,null,null,75,null,null,null,null,null,100,null,null,null,null,null,100,null,null,null,null,null,100,null,null,null,null,null,150,null,null,null,null,null,200,null,null,null,null,null,null,null,null,null,1]
[null,null,null,8102851360,8102851626,8102851238,8102851493,8102851105,8102851758,8102851378,8102851634,8102851246,8102851501,8102851113,8102851766,8102851386,8102851642,8102851253,8102851519,8102851121,8102851774,8102851402,8102851667,8102851279,8102851535,8102851147,8102851790,8102851410,8102851675,8102851287,8102851543,8102851154,8102851808,8102851428,8102851683,8102851295,8102851550,8102851162,8102851816,8102851436,8102851691,8102851303,8102851568,8102851170,8102851824,8102851444,8102851709,8102851311,8102851576,8102851188,8102851832,8102851469,8102851725,8102851337,8102851592,8102851204,8102851857,8102851477,8102851733,8102851345,8102851600,8102851212,8102851865]
[null,null,null,"8102843425","8102843680","8102843292","8102843557","8102843169","8102843813","8102843433","8102843698","8102843300","8102843565","8102843177","8102843821","8102843441","8102843706","8102843318","8102843573","8102843185","8102843839","8102843458","8102843714","8102843326","8102843581","8102843193","8102843847","8102843474","8102843730","8102843342","8102843607","8102843219","8102843862","8102843482","8102843748","8102843359","8102843615","8102843227","8102843870","8102843490","8102843755","8102843367","8102843623","8102843235","8102843888","8102843508","8102843763","8102843375","8102843631","8102843243","8102843896","8102843516","8102843771","8102843383","8102843649","8102843250","8102843904","8102843532","8102843797","8102843409","8102843664","8102843276","8102843920"]
[null,null,"Nettó ár €",70,null,null,null,null,null,80,null,null,null,null,null,90,null,null,null,null,null,110,null,null,null,null,null,130,null,null,null,null,null,160,null,null,null,null,null,190,null,null,null,null,null,270,null,null,null,null,null,330,null,null,null,null,null,500]
[null,null,null,1624164000,null,null,null,null,null,1,null,null,null,null,null,null,null,null,null,null,null,null,null,1624164200,null,null,null,null,null,null,null,null,null,null,null,null,null,null,null,null,null,null,null,null,1624164100]
[null,null,"Kiegészítők:","Műanyag indikátor:",null,null,null,null,null,null,null,null,null,null,null,null,null,null,null,null,null,null,null,"Műanyag nyomáskülönbség mérő:",null,null,null,null,null,null,null,null,null,null,null,null,null,null,null,null,null,null,null,null,"Alumínium nyomáskülönbség mérő:"]
[null,null,null,"G -C -P szűrők automata úszós leürítővel",null,null,null,null,null,null,null,null,null,null,null,null,null,"V -S -D szűrők manuális leürítővel szereltek"]
[null,null,"CIKLONSZŰRŐK","Ciklonszűrő vízcseppek illetve szilárd szennyeződések >10µm szűrésére. Közvtlen a kompresszor után javasolt. Működési hőmérséklet: 5-65 °C"]
[null,null,"Méret","A0",null,null,"A1",null,null,"A2",null,null,"A3",null,null,"A4",null,null,"A5",null,null,"A6",null,null,"A7",null,null,"A8",null,null,"A9",null,null,"A10",null,null,"A11",null,"A12",null,null,"A13",null,null,"A14",null,null,"A15",null,null,"A16",null,null,"A18",null,null,"A19",null,null,"A21"]
[null,null,"Típus\nNévl. teljesítm. [m3/h]","ASA1\n120",null,null,null,null,null,null,null,null,null,null,null,"ASA2\n155",null,null,null,null,null,"ASA3\n235",null,null,null,null,null,"ASA4\n365",null,null,null,null,null,"ASA5\n770",null,null,null,null,null,null,null,"ASA6\n1280",null,null,null,null,null,null,null,null,null,null,null,"ASA7\n2460"]
[null,null,"Levegőcsatlakozás","3/8\"",null,null,null,null,null,null,null,null,null,null,null,"1/2\"",null,null,null,null,null,"3/4\"",null,null,null,null,null,"1\"",null,null,null,null,null,"1 1/2\"",null,null,null,null,null,null,null,"2\"",null,null,null,null,null,null,null,null,null,null,null,"2 1/2\""]
[null,null,null,8973020269,null,null,null,null,null,null,null,null,null,null,null,8973020270,null,null,null,null,null,8973020271,null,null,null,null,null,8973020272,null,null,null,null,null,8973020273,null,null,null,null,null,null,null,8973020274,null,null,null,null,null,null,null,null,null,null,null,8973020275]
[null,null,null,"DF 60",null,null,null,null,null,null,null,null,null,null,null,"DF 120",null,null,null,null,null,"DF 200",null,null,null,null,null,"DF 340",null,null,null,null,null,"DF 510",null,null,null,null,null,null,null,"MF 800",null,null,null,null,null,null,null,null,null,null,null,"DF 1500"]
[null,null,"Méret [a x b x c]","187 x 88 x 20",null,null,null,null,null,null,null,null,null,null,null,"187 x 88 x 20",null,null,null,null,null,"257 x 88 x 20",null,null,null,null,null,"263 x 125 x 32",null,null,null,null,null,"461 x 125 x 32",null,null,null,null,null,null,null,"684 x 163 x 42",null,null,null,null,null,null,null,null,null,null,null,"684 x 163 x 42"]
[null,null,"Tömeg [kg]",0.7,null,null,null,null,null,null,null,null,null,null,null,0.7,null,null,null,null,null,0.8,null,null,null,null,null,1.8,null,null,null,null,null,2.5,null,null,null,null,null,null,null,5.0999999999999996,null,null,null,null,null,null,null,null,null,null,null,5.0999999999999996]
[null,null,"Méret szereléshez [d]",60,null,null,null,null,null,null,null,null,null,null,null,60,null,null,null,null,null,80,null,null,null,null,null,100,null,null,null,null,null,140,null,null,null,null,null,null,null,520,null,null,null,null,null,null,null,null,null,null,null,520]
[null,null,"Nettó ár €",60,null,null,null,null,null,null,null,null,null,null,null,60,null,null,null,null,null,70,null,null,null,null,null,110,null,null,null,null,null,140,null,null,null,null,null,null,null,290,null,null,null,null,null,null,null,null,null,null,null,330]

{"sheet":"ALUP LARGO","index":5,"n_rows":147,"n_cols":21,"rows_kept":147,"cut":false,"hidden":false,"merged":[[104,2,107,2],[108,2,110,2],[115,2,118,2],[119,2,121,2],[85,2,87,2],[85,7,85,8],[16,2,19,2],[16,10,19,10],[16,13,19,13],[52,5,52,6],[52,7,52,8],[53,5,53,6],[53,7,53,8],[54,5,54,6],[57,13,60,13],[71,2,72,2],[71,5,71,6],[71,7,71,8],[71,10,72,10],[71,13,72,13],[72,5,72,6],[72,7,72,8],[66,7,66,8],[68,2,70,2],[24,10,27,10],[24,13,25,13],[26,13,27,13],[20,10,23,10],[20,13,23,13],[20,16,23,16],[20,2,25,2],[51,7,51,8],[31,2,33,2],[31,10,33,10],[31,13,33,13],[31,16,33,16],[34,2,35,2],[34,10,35,10],[34,13,35,13],[34,16,35,16],[29,11,30,11],[29,14,30,14],[36,2,37,2],[36,10,37,10],[36,13,37,13],[36,16,37,16],[48,5,48,6],[48,7,48,8],[48,11,49,11],[48,14,49,14],[50,2,52,2],[50,5,50,6],[50,7,50,8],[50,10,52,10],[50,13,52,13],[50,16,52,16],[51,5,51,6],[48,19,49,19],[49,5,49,6],[49,7,49,8],[48,17,49,17],[66,19,67,19],[67,5,67,6],[67,7,67,8],[62,7,62,8],[63,13,64,13],[57,10,60,10],[58,5,58,6],[58,7,58,8],[59,5,59,6],[59,7,59,8],[60,5,60,6],[61,5,61,6],[61,7,61,8],[63,5,63,6],[63,7,63,8],[64,5,64,6],[54,7,54,8],[56,5,56,6],[56,7,56,8],[66,5,66,6],[61,2,62,2],[69,5,69,6],[69,7,69,8],[53,10,56,10],[64,7,64,8],[66,11,67,11],[61,10,64,10],[57,7,57,8],[73,5,73,6],[73,7,73,8],[68,5,68,6],[68,7,68,8],[68,10,70,10],[70,5,70,6],[70,7,70,8],[62,5,62,6],[60,7,60,8],[57,5,57,6],[53,2,56,2],[57,2,60,2],[55,5,55,6],[55,7,55,8],[85,10,87,10],[85,13,87,13],[86,7,86,8],[87,7,87,8],[83,5,83,6],[84,5,84,6],[85,5,85,6],[86,5,86,6],[87,5,87,6],[83,7,83,8],[83,11,84,11],[84,7,84,8],[132,5,132,6],[132,15,132,16],[132,17,132,18],[133,5,133,6],[133,7,133,8],[133,9,133,10],[133,11,133,12],[133,13,133,14],[133,15,133,16],[133,17,133,18],[134,17,134,18],[135,5,135,6],[135,7,135,8],[135,9,135,10],[135,11,135,12],[135,13,135,14],[135,15,135,16],[135,17,135,18],[134,5,134,6],[134,7,134,8],[134,9,134,10],[134,11,134,12],[134,13,134,14],[134,15,134,16],[136,17,136,18],[137,15,137,16],[137,17,137,18],[141,5,141,6],[141,15,141,16],[141,17,141,18],[136,5,136,6],[136,7,136,8],[136,9,136,10],[136,11,136,12],[136,13,136,14],[136,15,136,16],[137,5,137,6],[137,7,137,8],[137,9,137,10],[137,11,137,12],[137,13,137,14],[142,17,142,18],[143,5,143,6],[143,7,143,8],[143,9,143,10],[143,11,143,12],[143,13,143,14],[143,15,143,16],[143,17,143,18],[142,5,142,6],[142,7,142,8],[142,9,142,10],[142,11,142,12],[142,13,142,14],[142,15,142,16],[146,15,146,16],[146,17,146,18],[144,17,144,18],[145,5,145,6],[145,7,145,8],[145,9,145,10],[145,11,145,12],[145,13,145,14],[145,15,145,16],[145,17,145,18],[144,5,144,6],[144,7,144,8],[144,9,144,10],[144,11,144,12],[144,13,144,14],[144,15,144,16],[12,18,14,18],[12,3,14,3],[12,4,14,4],[12,5,14,5],[12,6,14,6],[12,7,14,7],[12,8,14,8],[12,9,14,9],[12,10,14,10],[113,11,114,11],[113,13,114,13],[12,12,14,12],[12,13,14,13],[12,15,14,15],[12,16,14,16],[12,17,15,17],[12,11,15,11],[12,14,15,14],[71,16,72,16],[83,14,84,14],[68,16,70,16],[66,14,67,14],[53,16,56,16],[61,16,64,16],[66,17,67,17],[29,17,30,17],[102,11,103,11],[102,13,103,13],[68,13,70,13],[61,13,62,13],[53,13,56,13],[57,16,60,16],[16,16,19,16]]}
["TARTALOM"]
["Árlista"]
["Megrendelő"]
["ABAC dugattyús kompresszorok"]
["ABAC CleanAir fogászati kompresszor"]
["AGRE ipari dugattyús kompresszorok"]
["ALUP SONETTO csavarkomp 2,2-15kW"]
["ALUP SCK csavarkomp 4-75kW"]
["ALUP LARGO, ALLEGRO csavarkompr"]
["ALUP Hűtveszárítók"]
["ALUP szűrők"]
["ALUP SpiralAir -Scroll kompresszor"]
["ALUP dugattyús kompresszorok",null,null,"Cikkszám","Max. üzemi nyomás\n","Térfogatáram (ISO 1217) \n7.5\n","Térfogatáram (ISO 1217) \n8 / 8.5\n","Térfogatáram (ISO 1217) \n10\n","Térfogatáram (ISO 1217) \n13\n","Névleges motortelj.","A X B x C","Alap gép","Tömeg","A X B x C","Alap gép\n+HVSZ","Tömeg","A X B x C","Alap gép\n+HVSZ\n500l-es tartályon","Tömeg"]
["OMEGA vonali szűrők"]
["OMEGA ciklonszűrők"]
["OMEGA olaj-víz szétválasztók",null,null,"A 41520","bar","m3/h","m3/h","m3/h","m3/h"," kW","mm",null,"kg","mm",null,"kg","mm",null,"kg"]
["ABAC sűrítők",null,"I.\nC67","LARGO 15","7.5, 8.5, 10, 13",165,155,137,119,15,"1395 x\n835x\n1220",7300,345,"1545 x\n835x\n1220",9200,400,"1940 x\n835x\n1835",10600,575]
["CONDOR nyomáskapcsolók",null,null,"LARGO 19","7.5, 8.5, 10, 13",202,192,176,140,18.5,null,7700,370,null,9600,430,null,11000,605]
["Tartályok",null,null,"LARGO 22","7.5, 8.5, 10, 13",234,226,198,168,22,null,8100,385,null,10100,445,null,11600,620]
["Egyéb alaktrészek",null,null,"LARGO 25","7.5, 8.5, 10, 13",258,244,228,200,26,null,8300,400,null,10300,460,null,11900,635]
[null,null,"II.\nC80","LARGO 11 E","7.5, 8.5, 10, 13",139,116,104,81,11,"1432 x 840 x 1278",7960,477,"1926 x 840 x 1278",9790,571,"1926 x 840 x 1900",10620,798]
[null,null,null,"LARGO 15 E","7.5, 8.5, 10, 13",171,157,135,115,15,null,8430,485,null,10270,529,null,11100,806]
[null,null,null,"LARGO 19 E","7.5, 8.5, 10, 13",206,195,170,147,18.5,null,8940,515,null,10940,631,null,11770,858]
[null,null,null,"LARGO 22 E","7.5, 8.5, 10, 13",243,224,202,176,22,null,9480,531,null,11480,647,null,12310,874]
[null,null,null,"LARGO 23","7.5, 8.5, 10, 13",237,223,203,175,22,"1550 x 830 x 1555",8800,465,"1555x 830x 1555",11000,525]
[null,null,null,"LARGO 26","7.5, 8.5, 10, 14",277,263,241,209,26,null,9000,480,null,11200,535]
[null,null,null,"LARGO 30","7.5, 8.5, 10, 13",335,306,281,245,30,null,12100,580,"2030x 830x 1555",14200,630]
[null,null,null,"LARGO 36","7.5, 8.5, 10, 13",374,346,310,281,37,null,12800,643,null,14900,652]
[]
[null,null,null,"Cikkszám","Max. üzemi nyomás\n","Térfogatáram (ISO 1217) \n7.5\n","Térfogatáram (ISO 1217) \n8 / 8.5\n","Térfogatáram (ISO 1217) \n10\n","Térfogatáram (ISO 1217) \n13\n","Névleges motortelj.","A X B x C","Alap gép","Tömeg","A X B x C","Alap gép\n+HVSZ","Tömeg"]
[null,null,null,"A 41520","bar","m3/h","m3/h","m3/h","m3/h"," kW","mm",null,"kg","mm",null,"kg"]
[null,null,"III.","LARGO 31","7.5, 8.5, 10, 13",353,320,288,"NO",30,"1420 x 1060 x 1630",14000,790,"1420 x 1060 x 1630",16400,790]
[null,null,null,"LARGO 37","7.5, 8.5, 10, 13",418,398,364,295,37.5,null,14800,870,null,17300,870]
[null,null,null,"LARGO 45","7.5, 8.5, 10, 13",497,472,432,369,45,null,15700,875,null,18200,875]
[null,null,"IV.","LARGO 55","7.5, 8.5, 10, 13",608,576,540,447,55,"1660 x 1060 x 1630",18000,1130,"1660 x 1060 x 1630",21200,1130]
[null,null,null,"LARGO 75","7.5, 8.5, 10, 13",781,763,680,582,75,null,19100,1317,null,22400,1317]
[null,null,"V.","LARGO 76","7.5, 8.5, 10, 13",882,834,742,629,75,"1860 x 1060 x 1630",22900,1570]
[null,null,null,"LARGO 90","7.5, 8.5, 10, 13",1026,1001,882,721,90,null,24200,1600]
[null,null,"VI.","LARGO 110","7.5, 8.5, 10, 13",1238,1181,1073,907,110,"2333x 1060x 1630",26900,1800]
[]
[]
[]
[]
[]
[]
[]
[]
[]
[null,null,null,"Cikkszám","Max. üzemi nyomás\n","Térfogatáram (ISO 1217) \n10\n",null,"Térfogatáram (ISO 1217) \n13\n",null,"Névleges motortelj.","A X B x C","Alap gép","Tömeg","A X B x C","Alap gép\n+HVSZ","Tömeg","A X B x C","Alap gép\n500l-es tartályon","Tömeg","Alap gép\n+HVSZ\n500l-es tartályon","Tömeg"]
[null,null,null,"A 41520","bar","m3/h",null,"m3/h",null," kW","mm",null,"kg","mm",null,"kg","mm",null,"kg",null,"kg"]
[null,null,"N.","ALLEGRO 8","5,5-12,5","16,6 - 64,8",null,"16,6 - 51,0",null,8,"1165 x 655 x 1045",6000,257,"1585 x 655 x 1045",7200,292,"1935 x 655 x 1680",7000,417,7900,452]
[null,null,null,"ALLEGRO 11","5,5-12,5","16,6 - 90,0",null,"16,6 - 73,8",null,11,null,6400,271,null,7600,321,null,7400,431,8300,481]
[null,null,null,"ALLEGRO 14","5,5-12,5","16,6 - 113,8",null,"16,6 - 85,3",null,15,null,6800,290,null,8000,340,null,7800,481,8700,500]
[null,null,"I. \nC67","ALLEGRO 15","5,5-13","47 - 152",null,"47 - 131",null,15,"1395 x\n835x\n1220",3800,325,"1545 x\n835x\n1220",4100,380,"1940 x\n835x\n1835","---",null,11700,555]
[null,null,null,"ALLEGRO 19","5,5-13","47 - 185",null,"47 - 149",null,18.5,null,4700,340,null,4800,400,null,"---",null,12300,575]
[null,null,null,"ALLEGRO 22","5,5-13","47 - 207",null,"47 - 185",null,22,null,5000,345,null,3800,410,null,null,null,12900,585]
[null,null,null,"ALLEGRO 25","5,5-13","47 - 229",null,"47 - 200",null,26,null,4800,365,null,4000,425,null,"---",null,12900,600]
[null,null,"II.","ALLEGRO 11 E","5-10, 5-13","44 - 138",null,"42 - 115",null,22,"1432 x 840 x 1278",10340,477,"1926 x 840 x 1278",12240,571,"1926 x 840 x 1900","---",null,12730,798]
[null,null,null,"ALLEGRO 15 E","5-10, 5-13","57 - 178",null,"43 - 158",null,26,null,10960,485,null,12870,579,null,"---",null,13330,806]
[null,null,null,"ALLEGRO 19 E","5-10, 5-13","57 - 219",null,"46 - 193",null,30,null,11620,515,null,13700,631,null,"---",null,14140,858]
[null,null,null,"ALLEGRO 22 E","5-10, 5-13","57 - 263",null,"51 - 229",null,37,null,12320,531,null,14390,647,null,"---",null,14820,874]
[null,null,null,"ALLEGRO 23","5-13","47 - 255",null,"47 - 255",null,22,"1555 x 830 x 1555",11200,456,"1555x 830x 1555",13400,525]
[null,null,null,"ALLEGRO 26","5-13","46 - 290",null,"46 - 290",null,26,null,11600,466,null,13800,535]
[null,null,null,"ALLEGRO 30S","5-13","61 - 348",null,"61 - 348",null,30,null,16000,515,"2030x 830x 1555",18000,630]
[null,null,null,"ALLEGRO 36","5-13","61 - 380",null,"61 - 380",null,37,null,16900,517,null,19000,652]
[]
[null,null,null,"Cikkszám","Max. üzemi nyomás\n","Térfogatáram (ISO 1217) \n10\n",null,"Térfogatáram (ISO 1217) \n13\n",null,"Névleges motortelj.","A X B x C","Alap gép","Tömeg","A X B x C","Alap gép\n+HVSZ","Tömeg"]
[null,null,null,"A 41520","bar","m3/h",null,"m3/h",null," kW","mm",null,"kg","mm",null,"kg"]
[null,null,"III.","ALLEGRO 31","4-10, 4-13","101 - 281",null,"87 - 229",null,30,"1420 x 1060 x 1630",19000,840,"2071 x 1060 x 1630",21500,1025]
[null,null,null,"ALLEGRO 37","4-10, 4-13","124 - 347",null,"107 - 277",null,37.5,null,20200,920,null,22700,1105]
[null,null,null,"ALLEGRO 45","4-10, 4-13","---",null,"---",null,45,null,null,925,null,"---",1110]
[null,null,"V.","ALLEGRO 76","4-10, 4-13","265 - 715",null,"221 - 610",null,75,"1660 x 1060 x 1630",30000,1640]
[null,null,null,"ALLEGRO 90","4-10, 4-13","292 - 821",null,"254 - 700",null,90,null,31800,"1670"]
[null,null,"VI.","ALLEGRO 110","4-10, 4-13","265 - 715",null,"221 - 610",null,75,"2333x 1060x 1630",34000,1900]
[]
[]
[]
[]
[]
[]
[]
[]
[]
[null,null,null,"Cikkszám","Max. üzemi nyomás\n","Térfogatáram (ISO 1217) \n10\n",null,"Térfogatáram (ISO 1217) \n13\n",null,"Névleges motortelj.","A X B x C","Alap gép","Tömeg","A X B x C","Alap gép\n+HVSZ","Tömeg"]
[null,null,null,"A 8158","bar","m3/h",null,"m3/h",null," kW","mm",null,"kg","mm",null,"kg"]
[null,null,"VII.\nEVO","EVOLUTO 45","4 - 13","108 - 486",null,"108 - 407",null,45,"1923 x 1060 x 1630",23060,860,"2773 x 1060 x 1630",25790,1060]
[null,null,null,"EVOLUTO 55","4 - 13","104 - 587",null,"104 - 493",null,55,null,26440,880,null,29950,1150]
[null,null,null,"EVOLUTO 75","4 - 13","101 - 698",null,"101 - 590",null,75,null,28020,900,null,31600,1170]
[]
[]
[]
[]
[]
[]
[]
[]
[]
[]
[]
[]
[]
[]
[null,null,null,"Cikkszám","Max. üzemi nyomás\n","Térfogatáram (ISO 1217) \n10\n","Térfogatáram (ISO 1217) \n10\n","Térfogatáram (ISO 1217) \n13\n","Térfogatáram (ISO 1217) \n10\n","Névleges motortelj.","A X B x C","Alap gép","Tömeg","Kompr beépített hőcserélő- vel"]
[null,null,null,"A 41520","bar","7\nm3/h","8\nm3/h","10\nm3/h","13\nm3/h"," kW","mm",null,"kg"]
[null,null,"VIII.","LARGO 132","7, 8, 10, 13",1516,1426,1260,1087,132,null,36100,null,40400]
[null,null,null,"LARGO 160","7, 8, 10, 13",1699,1649,1508,1314,160,null,40200,null,45000]
[null,null,null,"LARGO 200","7, 8, 10, 13",2056,1987,1818,1616,200,null,49400,null,55300]
[null,null,null,"LARGO 250","7, 8, 10, 13",2491,2358,2250,"1966",250,null,54500,null,61000]
[null,null,"IX.","LARGO 201","7, 8, 10",2351,2203,1998,null,200,null,53700,null,60200]
[null,null,null,"LARGO 251","7, 8, 10",2765,2538,2362,null,250,null,58400,null,65400]
[null,null,null,"LARGO 315","7, 8, 10",3139,3136,2894,null,315,null,63900,null,71600]
[]
[]
[null,null,null,"Cikkszám","Max. üzemi nyomás\n","Térfogatáram (ISO 1217) \n10\n","Térfogatáram (ISO 1217) \n10\n","Térfogatáram (ISO 1217) \n13\n","Térfogatáram (ISO 1217) \n10\n","Névleges motortelj.","A X B x C","Alap gép","Tömeg","Kompr beépített hőcserélő- vel"]
[null,null,null,"A 41520","bar","4-7\nm3/h","4-8\nm3/h","4-10\nm3/h","4-13\nm3/h"," kW","mm",null,"kg"]
[null,null,"VIII.","ALLEGRO 132","7, 8, 10, 13","454-1516","428-1426","378-1260","328-1087",132,null,49900,null,55800]
[null,null,null,"ALLEGRO 160","7, 8, 10, 13","511-1699","493-1649","454-1508","396-1314",160,null,57700,null,64600]
[null,null,null,"ALLEGRO 200","7, 8, 10, 13","616-2056","598-1987","547-1818","486-1616",200,null,69200,null,77600]
[null,null,null,"ALLEGRO 250","7, 8, 10, 13","749-2491","709-2358","677-2250","601-1966",250,null,78000,null,87300]
[null,null,"IX.","ALLEGRO 201","7, 8, 10","706-2351","659-2203","601-1998",null,200,null,75700,null,84800]
[null,null,null,"ALLEGRO 251","7, 8, 10","828-2765","763-2538","709-2362",null,250,null,83800,null,93900]
[null,null,null,"ALLEGRO 315","7, 8, 10","943-339","940-3136","868-2894",null,315,null,98200,null,110000]
[]
[]
[]
[]
[]
[]
[]
[]
[]
[]
[null,null,"Opciók (LARGO- ALLEGRO)",null,null,"N.",null,"I.",null,"II.",null,"III.",null,"IV.",null,"V.",null,"VI."]
[null,null,"MK 5.1 színes graf vezérlő (LARGO)",null,null,null,null,null,null,286,null,150,null,150,null,"STAND",null,"STAND"]
[null,null,"Előszűrő panel",null,null,null,null,null,null,null,null,110.00000000000001,null,110.00000000000001,null,110.00000000000001,null,110.00000000000001]
[null,null,"Beép. Automata ciklonszűrő",null,null,209.00000000000003,null,495.00000000000006,null,528,null,704,null,"NO",null,308,null,308]
[null,null,"Beépített hőcserélő",null,null,"NO",null,1628.0000000000002,null,2090,null,2970.0000000000005,null,3410.0000000000005,null,3960.0000000000005,null,3960.0000000000005]
[null,null,"Icons GSM kompresszor felügyelet",null,null,"150,-€ + 4.000,-Ft/hó",null,"150,-€ + 4.000,-Ft/hó",null,"150,-€ + 4.000,-Ft/hó",null,"150,-€ + 4.000,-Ft/hó",null,"150,-€ + 4.000,-Ft/hó",null,"150,-€ + 4.000,-Ft/hó",null,"150,-€ + 4.000,-Ft/hó"]
[]
[]
[]
[null,null,"Opciók (LARGO- ALLEGRO)",null,null,"EVO",null,"VIII.",null,"IX.",null,"X.",null,"XI.",null,"XII.",null,"XIII."]
[null,null,"MK 5.1 színes graf vezérlő (LARGO)"]
[null,null,"Előszűrő panel"]
[null,null,"Beép. Automata ciklonszűrő"]
[null,null,"Beépített hőcserélő"]
[null,null,"Élelmiszer ipari olaj"]

{"sheet":"ALUP SCK  ","index":6,"n_rows":58,"n_cols":21,"rows_kept":58,"cut":false,"hidden":false,"merged":[[31,5,31,7],[31,8,31,9],[31,10,31,11],[31,12,31,13],[31,14,31,15],[31,16,31,17],[31,18,31,19],[31,20,31,21],[32,8,32,9],[32,10,32,11],[32,12,32,13],[32,14,32,15],[32,16,32,17],[32,18,32,19],[32,20,32,21],[33,2,36,2],[33,8,33,9],[33,10,33,11],[33,12,33,13],[33,14,33,15],[33,16,33,17],[35,8,35,9],[35,10,35,11],[35,12,35,13],[35,14,35,15],[35,16,35,17],[33,18,33,19],[33,20,33,21],[34,8,34,9],[34,10,34,11],[34,12,34,13],[34,14,34,15],[34,16,34,17],[34,18,34,19],[34,20,34,21],[35,18,35,19],[35,20,35,21],[36,8,36,9],[36,10,36,11],[36,12,36,13],[36,14,36,15],[36,16,36,17],[36,18,36,19],[36,20,36,21],[37,2,41,2],[39,8,39,9],[39,10,39,11],[39,12,39,13],[39,14,39,15],[39,16,39,17],[37,3,37,21],[38,8,38,9],[38,10,38,11],[38,12,38,13],[38,14,38,15],[38,16,38,17],[38,18,38,19],[38,20,38,21],[39,18,39,19],[39,20,39,21],[40,8,40,9],[40,10,40,11],[40,12,40,13],[40,14,40,15],[40,16,40,17],[40,18,40,19],[40,20,40,21],[41,20,41,21],[43,5,43,7],[43,8,43,9],[43,10,43,11],[43,12,43,13],[43,14,43,15],[43,16,43,17],[43,18,43,19],[43,20,43,21],[41,8,41,9],[41,10,41,11],[41,12,41,13],[41,14,41,15],[41,16,41,17],[41,18,41,19],[46,10,46,11],[46,12,46,13],[46,14,46,15],[46,16,46,17],[46,18,46,19],[46,20,46,21],[44,20,44,21],[45,2,47,2],[45,8,45,9],[45,10,45,11],[45,12,45,13],[45,14,45,15],[45,16,45,17],[45,18,45,19],[45,20,45,21],[46,8,46,9],[44,8,44,9],[44,10,44,11],[44,12,44,13],[44,14,44,15],[44,16,44,17],[44,18,44,19],[49,10,49,11],[49,12,49,13],[49,14,49,15],[49,16,49,17],[49,18,49,19],[49,20,49,21],[47,20,47,21],[48,2,49,2],[48,8,48,9],[48,10,48,11],[48,12,48,13],[48,14,48,15],[48,16,48,17],[48,18,48,19],[48,20,48,21],[49,8,49,9],[47,8,47,9],[47,10,47,11],[47,12,47,13],[47,14,47,15],[47,16,47,17],[47,18,47,19],[48,3,48,4],[51,3,51,11],[51,12,51,13],[51,14,51,15],[51,18,51,19],[51,20,51,21],[52,3,52,11],[52,12,52,13],[52,14,52,15],[52,16,52,17],[52,18,52,19],[54,3,54,11],[54,12,54,13],[54,14,54,15],[54,16,54,17],[54,18,54,19],[54,20,54,21],[52,20,52,21],[53,3,53,11],[53,12,53,13],[53,14,53,15],[53,16,53,17],[53,18,53,19],[53,20,53,21],[57,3,57,11],[57,12,57,13],[57,14,57,15],[57,16,57,17],[57,18,57,19],[57,20,57,21],[56,3,56,11],[56,12,56,21],[55,3,55,11],[55,12,55,13],[55,14,55,15],[55,16,55,17],[55,18,55,19],[55,20,55,21]]}
["TARTALOM"]
["Árlista"]
["Megrendelő"]
["ABAC dugattyús kompresszorok"]
["ABAC CleanAir fogászati kompresszor"]
["AGRE ipari dugattyús kompresszorok"]
["ALUP SONETTO csavarkomp 2,2-15kW",null,"SCK 6-15 sorozatú ékszíjhatásos csavarkompresszorok"]
["ALUP SCK csavarkomp 4-75kW",null,"Nagyteljesítményű ékszíjmeghajtásos csavarkompresszor"]
["ALUP LARGO, ALLEGRO csavarkompr",null,"Széleskörű alkalmazhatóság"]
["ALUP Hűtveszárítók",null,"A sorozat irányvonalat ad a minőség, üzembiztonság, élettartam"]
["ALUP szűrők",null,"és kezelési kényelem tekintetében"]
["ALUP SpiralAir -Scroll kompresszor",null,"A sorozat mk5 vezérléssel készül, mely opcionálisan színes grafikus "]
["ALUP dugattyús kompresszorok",null,"kivitelben is elérhető"]
["OMEGA vonali szűrők",null,"Opcionálisan: ",null,null,"beépített hűtveszárító"]
["OMEGA ciklonszűrők",null,null,null,null,"cikloszűrő, kiegészítő szűrőpanel"]
["OMEGA olaj-víz szétválasztók",null,null,null,null,"élelmiszer ipari olaj"]
["ABAC sűrítők",null,null,null,null,"ICIONS mobilfeügyelet"]
["CONDOR nyomáskapcsolók"]
["Tartályok",null,"SCK 20-40  sorozatú ékszíjhatásos csavarkompresszorok "]
["Egyéb alaktrészek",null,"Egy lépcsővel nagyobb sűrítőjű (C67), nagyteljesítményű "]
[null,null,"ékszíjmeghajtásos csavarkompresszor"]
[]
[]
[]
[]
[null,null,"SCK 41-100 sorozatú ékszíjhatásos csavarkompresszorok"]
[null,null,"Nagy levegőigény esetén kedvező árú megoldást jelentenek."]
[null,null,"Nagyméretű sűrítővel készülnek folyamatos ipari felhasználás céljából."]
[]
[]
[]
[null,null,null,null,null,"Térfogatáram (ISO 1217)\nm3/min",null,null,"Névleges motortelj. (kW)",null,"Nettó ár\nalap gép",null,"Nettó ár beépített hűtveszárítóval",null,"Nettó ár \ntartály 270l",null,"Nettó ár \ntartály 500l",null,"Nettó ár \ntartály 270l + hűtveszárító",null,"Nettó ár \ntartály 500l + hűtveszárító"]
[null,null,null,null,null,"8 bar","10 bar","13 bar",null,null,null,null,"PLUSZ",null,"270l",null,"500l",null,"270l PLUSZ",null,"500l PLUSZ"]
[null,null,"I.","SCK 6",null,0.6,0.5,"-",4,null,4100,null,5020,null,4760,null,4840,null,5690,null,5760]
[null,null,null,"SCK 8",null,0.83,0.69,0.5,5.5,null,4360,null,5290,null,5030,null,5100,null,5950,null,6020]
[null,null,null,"SCK 10",null,1.17,1,0.8,7.5,null,4630,null,5550,null,5290,null,5360,null,6210,null,6290]
[null,null,null,"SCK 15",null,1.7,1.43,1.2,11,null,4900,null,5830,null,null,null,5640,null,6490,null,6560]
[null,null,"II.","Új C67 sűrítős gépek"]
[null,null,null,"SCK 20",null,2.5499999999999998,2.31,1.8720000000000001,15,null,6400,null,8300,null," ",null," ",null," ",null,9500]
[null,null,null,"SCK 25",null,3.1259999999999999,2.7,2.31,18.5,null,6800,null,8700,null," ",null," ",null," ",null,9900]
[null,null,null,"SCK 30",null,3.72,3.2160000000000002,2.7839999999999998,22,null,7200,null,9300,null," ",null," ",null," ",null,10500]
[null,null,null,"SCK 40",null,4.3319999999999999,3.9060000000000001,3.4319999999999999,30,null,7700,null,9700,null," ",null," ",null," "]
[]
[null,null,null,null,null,"Térfogatáram (ISO 1217)\nm3/min",null,null,"Névleges motortelj. (kW)",null,"Nettó ár\nalap gép"]
[null,null,null,null,null,"8 bar","10 bar","13 bar"]
[null,null,"III.","SCK 41",null,4.9000000000000004,4.3166666666666664,3.4666666666666668,30,null,10800]
[null,null,null,"SCK 50",null,6.1166666666666663,5.5333333333333332,4.25,37.5,null,11500]
[null,null,null,"SCK 60",null,7.7833333333333332,6.8166666666666664,5.7166666666666668,45,null,12200]
[null,null,"IV.","SCK 75",null,8.6999999999999993,7.916666666666667,7.083333333333333,55,null,16300]
[null,null,null,"SCK 100",null,11.516666666666667,10.083333333333334,8.8833333333333329,75,null,17300]
[]
[null,null,null,"Opciók",null,null,null,null,null,null,null,null,"I.",null,"II.",null,"III.",null,"IV.",null,"V."]
[null,null,null,"MK 5.1 színes graf vezérlő",null,null,null,null,null,null,null,null,190,null,190,null,"Alap",null,"Alap"]
[null,null,null,"Előszűrő panel",null,null,null,null,null,null,null,null,66,null,190,null,840,null,530]
[null,null,null,"Beép. Automata ciklonszűrő",null,null,null,null,null,null,null,null,275,null,220]
[null,null,null,"Beép. Automata vonaliszűrő (szárítós gépekhez)",null,null,null,null,null,null,null,null,407.00000000000006,null,300]
[null,null,null,"Icons GSM kompresszor felügyelet",null,null,null,null,null,null,null,null,"150,-€ + 4.000,-Ft/hó"]
[null,null,null,"Élelmiszer ipari olaj",null,null,null,null,null,null,null,null,"x",null,"x",null,"x",null,"x",null,"x"]

{"sheet":"ALUP SONETTO","index":7,"n_rows":53,"n_cols":21,"rows_kept":53,"cut":false,"hidden":false,"merged":[[23,5,23,7],[23,8,23,9],[23,10,23,11],[23,12,23,13],[23,14,23,15],[23,18,23,19],[23,20,23,21],[24,8,24,9],[24,10,24,11],[24,12,24,13],[24,14,24,15],[24,16,24,17],[24,18,24,19],[24,20,24,21],[23,16,23,17],[25,20,25,21],[26,8,26,9],[26,10,26,11],[26,12,26,13],[26,14,26,15],[26,16,26,17],[26,18,26,19],[26,20,26,21],[25,8,25,9],[25,10,25,11],[25,12,25,13],[25,14,25,15],[25,16,25,17],[25,18,25,19],[27,20,27,21],[28,8,28,9],[28,10,28,11],[28,12,28,13],[28,14,28,15],[28,16,28,17],[28,18,28,19],[28,20,28,21],[27,8,27,9],[27,10,27,11],[27,12,27,13],[27,14,27,15],[27,16,27,17],[27,18,27,19],[39,2,39,9],[44,6,44,7],[44,8,44,9],[44,10,44,11],[44,12,44,13],[44,16,44,17],[44,18,44,19],[45,6,45,7],[45,8,45,9],[45,10,45,11],[45,12,45,13],[45,14,45,15],[45,16,45,17],[45,18,45,19],[44,14,44,15],[47,18,47,19],[46,8,46,9],[46,10,46,11],[46,12,46,13],[46,14,46,15],[46,16,46,17],[46,18,46,19],[47,8,47,9],[47,10,47,11],[47,12,47,13],[47,14,47,15],[47,16,47,17],[49,18,49,19],[48,8,48,9],[48,10,48,11],[48,12,48,13],[48,14,48,15],[48,16,48,17],[48,18,48,19],[49,8,49,9],[49,10,49,11],[49,12,49,13],[49,14,49,15],[49,16,49,17],[51,18,51,19],[50,8,50,9],[50,10,50,11],[50,12,50,13],[50,14,50,15],[50,16,50,17],[50,18,50,19],[51,8,51,9],[51,10,51,11],[51,12,51,13],[51,14,51,15],[51,16,51,17]]}
["TARTALOM"]
["Árlista"]
["Megrendelő"]
["ABAC dugattyús kompresszorok"]
["ABAC CleanAir fogászati kompresszor"]
["AGRE ipari dugattyús kompresszorok"]
["ALUP SONETTO csavarkomp 2,2-15kW"]
["ALUP SCK csavarkomp 4-75kW"]
["ALUP LARGO, ALLEGRO csavarkompr"]
["ALUP Hűtveszárítók",null,"ÚJ SONETTO 8-20 sorozat a sűrített levegő ellátás leggazdaságosabb"]
["ALUP szűrők",null,"módja. Változatlan ár mellett jobb hatásfokkal, felhasználó barát, digitális"]
["ALUP SpiralAir -Scroll kompresszor",null,"vezérléssel. "]
["ALUP dugattyús kompresszorok",null,"Ékszíjmeghajtásos csavarkompresszor"]
["OMEGA vonali szűrők",null,"Kompakt felépítés, egyszerű és hatékony használat"]
["OMEGA ciklonszűrők",null,"Alacsony zajszint 65-68 dB (A)"]
["OMEGA olaj-víz szétválasztók",null,"Ipari használatra méretezett sűrítő"]
["ABAC sűrítők",null,"Opcionálisan: ",null,null,"ADQ hűtveszárítóval"]
["CONDOR nyomáskapcsolók",null,"INFOLOGIC2 elektronikával vezérelt"]
["Tartályok",null,"Nyomás álltás, hőfok kijelzés, szerviz figyeleztetés"]
["Egyéb alaktrészek",null,"hiba kijelzés stb."]
[]
[]
[null,null,null,null,null,null,null,null,null,null,"Tartályra szerelve 270 /500l"]
[null,null,null,null,null,"Térfogatáram (ISO 1217)\nm3/min",null,null,"Névleges motortelj. (kW)",null,"Nettó ár \nalap gép",null,"Nettó ár tartályra szerelve 270l",null,"Nettó ár \ntartály 270l + hűtveszárító",null,"Nettó ár tartályra szerelve 500l",null,"Nettó ár \ntartály 500l + hűtveszárító",null,"Kompakt gép opciós elő- és utószűrővel "]
[null,null,null,null,null,"8 bar","10 bar","13 bar",null,null,null,null,"270l",null,"270l PLUSZ",null,"500l",null,"500l PLUSZ",null,"270/500l + F"]
[null,null,null,"Sonetto 8",null,0.84599999999999997,0.69599999999999995,"-",5.5,null,3440,null,3720,null,4380,null,3790,null,4450,null,"+ 220 €"]
[null,null,null,"Sonetto 10",null,1.1399999999999999,0.996,0.78,7.5,null,3650,null,3930,null,4590,null,3990,null,4660,null,"+ 220 €"]
[null,null,null,"Sonetto 15",null,1.62,1.4159999999999999,1.1519999999999999,11,null,3860,null,4140,null,4810,null,4210,null,4880,null,"+ 250 €"]
[null,null,null,"Sonetto 20",null,1.86,1.68,1.3320000000000001,15,null,4100,null,4380,null,5040,null,4420,null,5110,null,"+ 250 €"]
[null,null,null,null,null,null,null,"* Opciós idővezérelt leürítő a tartály aljára szerelve: 75,-€"]
[]
[]
[]
[]
[]
[]
[]
[]
[null,null,"SCK MINI 3-7 sorozat a legkisebb"]
[null,null,"Az SCK MINI sorozat kicsi, kompakt megbízható technológia a legmagasabb minőségi szabványokkal. Kiváló zajcsillapítás, könnyű használat, egyszerű felépítés."]
[null,null,"Opcionálisan: ",null,null,"ADQ hűtveszárítóval"]
[]
[]
[null,null,null,null,null,null,null,null,null,null,"Tartályra szerelve 200 /270l"]
[null,null,null,null,null,null,"Térfogatáram (ISO 1217)\nm3/min",null,"Névleges motortelj. (kW)",null,"Nettó ár\nalap gép",null,"Nettó ár tartályra szerelve 200l",null,"Nettó ár \ntartály 200l + hűtveszárító",null,"Nettó ár tartályra szerelve 270l",null,"Nettó ár \ntartály 270l + hűtveszárító"]
[null,null,null,null,null,null,"8 és 10 bar",null,null,null,null,null,"200l",null,"200l PLUSZ",null,"270l",null,"270l PLUSZ"]
[null,null,null,"SCK 3","230V","400V",0.3,0.24,2.2000000000000002,null,2290,null,2460,null,2960,null,2530,null,3030]
[null,null,null,"SCK 4",null,"400V",0.44,0.32,3,null,2450,null,2620,null,3110,null,2690,null,3190]
[null,null,null,"SCK 5",null,"400V",0.56000000000000005,0.47,4,null,2620,null,2790,null,3290,null,2860,null,3310]
[null,null,null,"SCK 5X","ΥΔ","400V",0.56000000000000005,0.47,4,null,2710,null,2880,null,3330,null,2960,null,3400]
[null,null,null,"SCK 7","ΥΔ","400V",0.7,0.6,5.5,null,2790,null,2950,null,3400,null,3030,null,3480]
[null,null,null,"SCK 9*","ΥΔ","400V",1.01,0.92,7.5,null,3430,null,3540,null,4170,null,3690,null,4340]
[null,null,null,null,"* SCK 9 készülék a Sonetto sűrítőjével szerelve",null,null,null,null,null,null,null,"* Opciós idővezérelt leürítő a tartály aljára szerelve: 75,-€"]

{"sheet":"ALUP PRACTIC","index":8,"n_rows":65,"n_cols":23,"rows_kept":65,"cut":false,"hidden":false,"merged":[]}
["TARTALOM"]
["Árlista"]
["Megrendelő"]
["ABAC dugattyús kompresszorok"]
["ABAC CleanAir fogászati kompresszor"]
["AGRE ipari dugattyús kompresszorok"]
["ALUP SONETTO csavarkomp 2,2-15kW"]
["ALUP SCK csavarkomp 4-75kW"]
["ALUP LARGO, ALLEGRO csavarkompr"]
["ALUP Hűtveszárítók"]
["ALUP szűrők"]
["ALUP SpiralAir -Scroll kompresszor"]
["ALUP dugattyús kompresszorok"]
["OMEGA vonali szűrők"]
["OMEGA ciklonszűrők"]
["OMEGA olaj-víz szétválasztók"]
["ABAC sűrítők"]
["CONDOR nyomáskapcsolók"]
["Tartályok"]
["Egyéb alaktrészek"]
[]
[]
[]
[]
[]
[]
[]
[]
[]
[]
[]
[]
[]
[]
[]
[]
[]
[null,null,null,null,null,null,null,null,null,null,null,null,null,null,null,null,null,null,null,null,null,null,"Nettó ár €"]
[]
[]
[null,null,null,null,null,null,null,null,null,null,null,null,null,null,null,null,null,null,null,null,4116002086,"ENGINEAIR 4/100 PETROL",{"$f":"VLOOKUP(U41,Árlista!B:D,3,0)","v":"1 210,-€ "}]
[null,null,null,null,null,null,null,null,null,null,null,null,null,null,null,null,null,null,null,null,4116002087,"ENGINEAIR 5/50 PETROL",{"$f":"VLOOKUP(U42,Árlista!B:D,3,0)","v":"1 320,-€ "}]
[null,null,null,null,null,null,null,null,null,null,null,null,null,null,null,null,null,null,null,null,4116002088,"ENGINEAIR 5/100 PETROL",{"$f":"VLOOKUP(U43,Árlista!B:D,3,0)","v":"1 420,-€ "}]
[null,null,null,null,null,null,null,null,null,null,null,null,null,null,null,null,null,null,null,null,4116002089,"ENGINEAIR 5/200 PETROL",{"$f":"VLOOKUP(U44,Árlista!B:D,3,0)","v":"1 710,-€ "}]
[null,null,null,null,null,null,null,null,null,null,null,null,null,null,null,null,null,null,null,null,4116002090,"ENGINEAIR 5/11+11 PETROL",{"$f":"VLOOKUP(U45,Árlista!B:D,3,0)","v":"1 480,-€ "}]
[null,null,null,null,null,null,null,null,null,null,null,null,null,null,null,null,null,null,null,null,4116002091,"ENGINEAIR 5/11+11R PETROL",{"$f":"VLOOKUP(U46,Árlista!B:D,3,0)","v":"1 600,-€ "}]
[null,null,null,null,null,null,null,null,null,null,null,null,null,null,null,null,null,null,null,null,4116022690,"ENGINEAIR 7/25+25R PETROL",{"$f":"VLOOKUP(U47,Árlista!B:D,3,0)","v":"2 880,-€ "}]
[null,null,null,null,null,null,null,null,null,null,null,null,null,null,null,null,null,null,null,null,4116022691,"ENGINEAIR 7/25+25R PETROL",{"$f":"VLOOKUP(U48,Árlista!B:D,3,0)","v":"3 400,-€ "}]
[null,null,null,null,null,null,null,null,null,null,null,null,null,null,null,null,null,null,null,null,4116022692,"ENGINEAIR 11/270 PETROL",{"$f":"VLOOKUP(U49,Árlista!B:D,3,0)","v":"3 810,-€ "}]
[null,null,null,null,null,null,null,null,null,null,null,null,null,null,null,null,null,null,null,null,4116022693,"ENGINEAIR 8/270 DIESEL",{"$f":"VLOOKUP(U50,Árlista!B:D,3,0)","v":"4 530,-€ "}]
[null,null,null,null,null,null,null,null,null,null,null,null,null,null,null,null,null,null,null,null,4116022694,"ENGINEAIR 11/270 DIESEL",{"$f":"VLOOKUP(U51,Árlista!B:D,3,0)","v":"5 870,-€ "}]
[null,null,null,null,null,null,null,null,null,null,null,null,null,null,null,null,null,null,null,null,4116022695,"ENGINEAIR 8/270 DIESEL 2.2KVA",{"$f":"VLOOKUP(U52,Árlista!B:D,3,0)","v":"5 770,-€ "}]
[null,null,null,null,null,null,null,null,null,null,null,null,null,null,null,null,null,null,null,null,4116022696,"ENGINEAIR 11/270 DIESEL 2.2KVA",{"$f":"VLOOKUP(U53,Árlista!B:D,3,0)","v":"6 590,-€ "}]
[]
[null,null,null,null,null,null,null,null,null,null,null,null,null,null,null,null,null,null,null,null,4116002092,"ENGINEAIR 4 PETROL",{"$f":"VLOOKUP(U55,Árlista!B:D,3,0)","v":"1 140,-€ "}]
[null,null,null,null,null,null,null,null,null,null,null,null,null,null,null,null,null,null,null,null,4116002093,"ENGINEAIR 5 PETROL",{"$f":"VLOOKUP(U56,Árlista!B:D,3,0)","v":"1 260,-€ "}]
[null,null,null,null,null,null,null,null,null,null,null,null,null,null,null,null,null,null,null,null,4116002073,"ENGINEAIR 7 PETROL",{"$f":"VLOOKUP(U57,Árlista!B:D,3,0)","v":"2 470,-€ "}]
[null,null,null,null,null,null,null,null,null,null,null,null,null,null,null,null,null,null,null,null,4116002074,"ENGINEAIR 11 PETROL",{"$f":"VLOOKUP(U58,Árlista!B:D,3,0)","v":"2 680,-€ "}]
[null,null,null,null,null,null,null,null,null,null,null,null,null,null,null,null,null,null,null,null,4116002082,"ENGINEAIR 12 PETROL",{"$f":"VLOOKUP(U59,Árlista!B:D,3,0)","v":"2 880,-€ "}]
[null,null,null,null,null,null,null,null,null,null,null,null,null,null,null,null,null,null,null,null,4116002075,"ENGINEAIR 8 DIESEL",{"$f":"VLOOKUP(U60,Árlista!B:D,3,0)","v":"4 120,-€ "}]
[null,null,null,null,null,null,null,null,null,null,null,null,null,null,null,null,null,null,null,null,4116002076,"ENGINEAIR 11 DIESEL",{"$f":"VLOOKUP(U61,Árlista!B:D,3,0)","v":"4 940,-€ "}]
[null,null,null,null,null,null,null,null,null,null,null,null,null,null,null,null,null,null,null,null,4116002083,"ENGINEAIR 12 DIESEL",{"$f":"VLOOKUP(U62,Árlista!B:D,3,0)","v":"5 150,-€ "}]
[null,null,null,null,null,null,null,null,null,null,null,null,null,null,null,null,null,null,null,null,4116002077,"BI ENGINEAIR 8 DIESEL 2.2KVA",{"$f":"VLOOKUP(U63,Árlista!B:D,3,0)","v":"4 840,-€ "}]
[null,null,null,null,null,null,null,null,null,null,null,null,null,null,null,null,null,null,null,null,4116002078,"BI ENGINEAIR 11 DIESEL 2.2KVA",{"$f":"VLOOKUP(U64,Árlista!B:D,3,0)","v":"5 770,-€ "}]
[null,null,null,null,null,null,null,null,null,null,null,null,null,null,null,null,null,null,null,null,4116002084,"BI ENGINEAIR 12 DIESEL 3KVA",{"$f":"VLOOKUP(U65,Árlista!B:D,3,0)","v":"6 080,-€ "}]

{"sheet":"ALUP Hűtveszárító","index":9,"n_rows":68,"n_cols":26,"rows_kept":68,"cut":false,"hidden":false,"merged":[[15,3,15,14],[15,15,15,25],[16,3,16,7],[16,8,16,14],[16,15,16,18],[16,19,16,25],[17,3,17,7],[17,8,17,25],[18,3,18,7],[18,8,18,9],[18,10,18,12],[18,13,18,14],[18,15,18,18],[18,19,18,22],[18,23,18,25],[19,23,19,25],[19,3,19,7],[19,8,19,9],[19,10,19,12],[19,13,19,14],[19,15,19,18],[19,19,19,22],[12,8,13,8],[12,9,13,9],[12,10,13,10],[12,11,13,11],[12,2,13,2],[12,3,13,3],[12,4,13,4],[12,5,13,5],[12,6,13,6],[12,22,13,22],[12,23,13,23],[12,24,13,24],[12,25,13,25],[24,7,25,7],[12,17,13,17],[12,18,13,18],[12,19,13,19],[12,20,13,20],[12,21,13,21],[12,12,13,12],[12,13,13,13],[12,14,13,14],[12,15,13,15],[12,16,13,16],[12,7,13,7],[33,3,33,14],[33,15,33,25],[34,3,34,9],[34,10,34,14],[34,15,34,18],[34,19,34,25],[35,3,35,9],[35,10,35,14],[36,3,36,8],[36,9,36,10],[36,11,36,14],[36,15,36,18],[36,19,36,22],[36,23,36,25],[37,3,37,9],[37,10,37,14]]}
["TARTALOM"]
["Árlista"]
["Megrendelő"]
["ABAC dugattyús kompresszorok"]
["ABAC CleanAir fogászati kompresszor"]
["AGRE ipari dugattyús kompresszorok"]
["ALUP SONETTO csavarkomp 2,2-15kW"]
["ALUP SCK csavarkomp 4-75kW"]
["ALUP LARGO, ALLEGRO csavarkompr"]
["ALUP Hűtveszárítók"]
["ALUP szűrők"]
["ALUP SpiralAir -Scroll kompresszor",null,"Méret","A0","A1","A2","A3","A4","A5","A6","A7","A7,5","A8","A9","A10","A11","A12","A13","A14","A15","A16","A17","A17,5","A18","A19","A19"]
["ALUP dugattyús kompresszorok",null,"Típus\nNévl. teljesítm. [m3/h]","ADQ\n21","ADQ\n36","ADQ\n51","ADQ\n72","ADQ 110","ADQ 141","ADQ 180","ADQ 216","ADQ 246","ADQ 312","ADQ 390","ADQ 462","ADQ 600","ADQ 720","ADQ 900","ADQ 1080","ADQ 1440","ADQ 1800","ADQ 2100","ADQ 2700","ADQ 3000","ADQ 4200","ADQ 5040"]
["OMEGA vonali szűrők"]
["OMEGA ciklonszűrők",null,"Elektromos teljesítmény [kW]",0.13,0.16,0.19,0.27,0.28000000000000003,0.61,0.67,0.79,0.87,1.07,1.19,1.45,1.82,2.0099999999999998,2.64,3.57,3.9,4.46,5.55,5.55,6.8,10.199999999999999,10.199999999999999]
["OMEGA olaj-víz szétválasztók",null,"Elektromos csatlakozás","230V/50",null,null,null,null,null,null,null,null,null,null,null,"400V/50/3"]
["ABAC sűrítők",null,"Hűtőközeg","R134",null,null,null,null,"R404A",null,null,null,null,null,null,"R410A",null,null,null,"R404A"]
["CONDOR nyomáskapcsolók",null,"Max. nyomás","16 bar",null,null,null,null,"13 bar"]
["Tartályok",null,"Levegőcsatlakozás","3/4\"",null,null,null,null,"1\"",null,"1 1/2\"",null,null,"1 1/2\"",null,"2\"",null,null,null,"3\"",null,null,null,"DN125"]
["Egyéb alaktrészek",null,"Méret h x sz x m [mm]","390 x 484 x 511",null,null,null,null,"370 x 764 x 515",null,"460 x 789 x 575 ",null,null,"580 x 899 x 604",null,"735 x 1016 x 898",null,null,null,"1020 x 1560 x 1082",null,null,null,"1100 x 1560 x 2099"]
[null,null,"Tömeg [kg]",19,19,20,25,27,44,44,53,60,65,80,80,128,146,158,165,325,335,350,350,550,600,600]
[null,null,"Nettó ár €",4102000792,4102000793,4102000794,4102000795,4102000796,4102000797,4102000798,4102000799,4102000800,4102000801,4102000802,4102000803,4102001548,4102001549,4102001550,4102001551,4102001156,4102001157,4102001158,4102001232,4102001159,4102001160,4102001317]
[null,null,"Nettó ár €",520,610,690,740,820,870,1100,1240,1420,1610,1800,2100,2900,3400,3900,4800,6400,7400,8800,11100,12200,14700,17300]
[]
[]
[]
[]
[]
[]
[null,null,"Méret","C0","C1","C2","C3","C4","C5","C6","C7","C7,5","C8","C9","C10"]
[null,null,"Típus\nNévl. teljesítm. [m3/h]","COOL\n21","COOL\n36","COOL\n51","COOL\n72","COOL 110","COOL 129","COOL 180","COOL 216","COOL 246","COOL 312","COOL 390","COOL 462"]
[null,null,null,4102001760,4102001761,4102001762,4102001763,4102001764,4102001765,4102001847,4102002090,4102002091,4102002092,4102002093,4102002094]
[null,null,"Elektromos teljesítmény [kW]",0.126,0.126,0.16300000000000001,0.22800000000000001,0.29299999999999998,0.38,0.41899999999999998,0.66400000000000003,0.76700000000000002,0.86499999999999999,1.028,1.242]
[null,null,"Elektromos csatlakozás","230V/50"]
[null,null,"Hűtőközeg","R134",null,null,null,null,null,null,"R404A"]
[null,null,"Max. nyomás","16 bar",null,null,null,null,null,null,"13 bar"]
[null,null,"Levegőcsatlakozás","3/4\"",null,null,null,null,null,"1\"",null,"1 1/2\""]
[null,null,"Méret h x sz x m [mm]","233 x 559 x 561",null,null,null,null,null,null,"310 x 706 x 994"]
[null,null,"Tömeg [kg]",19,19,19,20,25,27,30,52,57,59,80,80]
[null,null,"Nettó ár €",430,540,590,640,710,750,940,1070,1220,1390,1590,1800]
[]
[]
[null,null,"Terem hőmérséklet [°C]",25,30,35,40,45]
[null,null,"Korrekciós faktor [A]",1,0.92,0.84,0.8,0.74]
[null,null,"Működési hőmérséklet [°C]",30,35,40,45,50,55]
[null,null,"Korrekciós faktor [B]",1.24,1,0.82,0.69,0.57999999999999996,0.45]
[null,null,"Üzemi nyomás [bar]",5,6,7,8,9,10,11,12,13,14]
[null,null,"Korrekciós faktor ©",0.9,0.96,1,1.03,1.06,1.08,1.1000000000000001,1.1200000000000001,1.1299999999999999,1.1499999999999999]
[]
[]
[]
[]
[null,null,"Típus","Alup Cool 21",{"$f":"C53&\": \"&D53","v":"Típus: Alup Cool 21"}]
[null,null,"Cikkszám",null,{"$f":"C54&\": \"&D54","v":"Cikkszám: "}]
[null,null,"Max. nyomásszint (bar)",16,"Max. nyomásszint (bar): 16"]
[null,null,"Levegőkezelési teljesítmény P 7 bar, T(külső) 25°C, T(be) 35°C (l/perc) ",350,"Levegőkezelési teljesítmény P 7 bar, T(külső) 25°C, T(be) 35°C (l/perc) : 350"]
[null,null,"Harmatpont","+5 °C +/- 1","Harmatpont: +5 °C +/- 1"]
[null,null,"Névleges elektromos teljesítmény (W)",126,"Névleges elektromos teljesítmény (W): 126"]
[null,null,"Hálózati feszültség (V/ph/Hz)","230/1/50","Hálózati feszültség (V/ph/Hz): 230/1/50"]
[null,null,"Légcsatlakozások (in-out)","3/4\" KM","Légcsatlakozások (in-out): 3/4\" KM"]
[null,null,"Méretek (hossz x szélesség x magasság mm)","233 x 559 x 561","Méretek (hossz x szélesség x magasság mm): 233 x 559 x 561"]
[null,null,"Súly (kg)",19,"Súly (kg): 19"]
[null,null,"Hűtőgáz típusa","R134a","Hűtőgáz típusa: R134a"]
[null,null,"Üzemeltetési hőmérséklet tartomány ","+5 - 40 °C","Üzemeltetési hőmérséklet tartomány : +5 - 40 °C"]
[null,null,"Max belépő levegő hőmérséklet","50 °C","Max belépő levegő hőmérséklet: 50 °C"]
[null,null,"Megjegyzés","A hűtveszárító légszárítási teljesítményét az üzelemtetési hőmérsékleti tartományok T(be) -belépő levegő hőmérséklet, T(külső) -terem hőmérséklet nagy mértékben befolyásolják. A referenci értékektől való eltérésnél vegye figyelembe a gyártó által megadott korrekciós tényezőket!","Megjegyzés: A hűtveszárító légszárítási teljesítményét az üzelemtetési hőmérsékleti tartományok T(be) -belépő levegő hőmérséklet, T(külső) -terem hőmérséklet nagy mértékben befolyásolják. A referenci értékektől való eltérésnél vegye figyelembe a gyártó által megadott korrekciós tényezőket!"]
[]
[null,null,null,"Megjegyzés: A hűtveszárító légszárítási teljesítményét az üzemeltetési hőmérsékleti tartományok T(be) -belépő levegő hőmérséklet, T(külső) -terem hőmérséklet nagy mértékben befolyásolják! A referencia értékektől való eltérésnél, vegye figyelembe a gyártó által megadott korrekciós tényezőket!"]

{"sheet":"SpiralAir","index":10,"n_rows":101,"n_cols":21,"rows_kept":101,"cut":false,"hidden":false,"merged":[[15,2,24,9],[28,8,28,9],[28,10,28,11],[28,12,28,13],[28,14,28,15],[28,16,28,17],[28,18,28,19],[28,20,28,21],[29,8,29,9],[29,10,29,11],[29,12,29,13],[29,14,29,15],[29,16,29,17],[29,18,29,19],[29,20,29,21],[30,20,30,21],[31,8,31,9],[31,10,31,11],[31,12,31,13],[31,14,31,15],[31,16,31,17],[31,18,31,19],[31,20,31,21],[30,8,30,9],[30,10,30,11],[30,12,30,13],[30,14,30,15],[30,16,30,17],[30,18,30,19],[32,20,32,21],[33,8,33,9],[33,10,33,11],[33,12,33,13],[33,14,33,15],[33,16,33,17],[33,18,33,19],[33,20,33,21],[32,8,32,9],[32,10,32,11],[32,12,32,13],[32,14,32,15],[32,16,32,17],[32,18,32,19],[34,20,34,21],[35,8,35,9],[35,10,35,11],[35,12,35,13],[35,14,35,15],[35,16,35,17],[35,18,35,19],[35,20,35,21],[34,8,34,9],[34,10,34,11],[34,12,34,13],[34,14,34,15],[34,16,34,17],[34,18,34,19],[36,20,36,21],[37,8,37,9],[37,10,37,11],[37,12,37,13],[37,14,37,15],[37,16,37,17],[37,18,37,19],[37,20,37,21],[36,8,36,9],[36,10,36,11],[36,12,36,13],[36,14,36,15],[36,16,36,17],[36,18,36,19],[38,20,38,21],[44,8,44,9],[44,10,44,11],[44,12,44,13],[44,14,44,15],[44,16,44,17],[44,18,44,19],[44,20,44,21],[38,8,38,9],[38,10,38,11],[38,12,38,13],[38,14,38,15],[38,16,38,17],[38,18,38,19],[45,20,45,21],[46,8,46,9],[46,10,46,11],[46,12,46,13],[46,14,46,15],[46,16,46,17],[46,18,46,19],[46,20,46,21],[45,8,45,9],[45,10,45,11],[45,12,45,13],[45,14,45,15],[45,16,45,17],[45,18,45,19],[47,20,47,21],[48,8,48,9],[48,10,48,11],[48,12,48,13],[48,14,48,15],[48,16,48,17],[48,18,48,19],[48,20,48,21],[47,8,47,9],[47,10,47,11],[47,12,47,13],[47,14,47,15],[47,16,47,17],[47,18,47,19],[49,20,49,21],[50,8,50,9],[50,10,50,11],[50,12,50,13],[50,14,50,15],[50,16,50,17],[50,18,50,19],[50,20,50,21],[49,8,49,9],[49,10,49,11],[49,12,49,13],[49,14,49,15],[49,16,49,17],[49,18,49,19],[51,20,51,21],[52,8,52,9],[52,10,52,11],[52,12,52,13],[52,14,52,15],[52,16,52,17],[52,18,52,19],[52,20,52,21],[51,8,51,9],[51,10,51,11],[51,12,51,13],[51,14,51,15],[51,16,51,17],[51,18,51,19],[53,20,53,21],[54,8,54,9],[54,10,54,11],[54,12,54,13],[54,14,54,15],[54,16,54,17],[54,18,54,19],[54,20,54,21],[53,8,53,9],[53,10,53,11],[53,12,53,13],[53,14,53,15],[53,16,53,17],[53,18,53,19],[94,5,94,6],[94,8,94,9],[94,11,94,12],[94,15,94,16],[95,8,95,9],[95,10,98,10],[95,11,95,12],[95,14,98,14],[95,15,95,16],[96,8,96,9],[96,11,96,12],[96,15,96,16],[97,8,97,9],[97,11,97,12],[97,15,97,16],[98,8,98,9],[98,11,98,12],[98,15,98,16],[99,8,99,9],[99,10,100,10],[99,11,99,12],[99,14,100,14],[99,15,99,16],[100,8,100,9],[100,11,100,12],[100,15,100,16],[93,8,93,9],[93,11,93,12],[93,15,93,16]]}
["TARTALOM"]
["Árlista"]
["Megrendelő"]
["ABAC dugattyús kompresszorok"]
["ABAC CleanAir fogászati kompresszor"]
["AGRE ipari dugattyús kompresszorok"]
["ALUP SONETTO csavarkomp 2,2-15kW"]
["ALUP SCK csavarkomp 4-75kW"]
["ALUP LARGO, ALLEGRO csavarkompr"]
["ALUP Hűtveszárítók"]
["ALUP szűrők"]
["ALUP SpiralAir -Scroll kompresszor"]
["ALUP dugattyús kompresszorok"]
["OMEGA vonali szűrők",null,"ALUP SPR spirál kompresszorok"]
["OMEGA ciklonszűrők"]
["OMEGA olaj-víz szétválasztók",null,"Az SPR sorozatú spirálkompresszorok a legújabb technológiával készülnek: \n- Olajmentes spirál sűrítő\n- Standard IE3 hatásfokú motor\n- Megbízható technológia a legmagasabb minőségi szabványokkal. \n- 8 és 10 bar max nyomásra optimalizálva\n- Beépített hűtveszárítóval is rendelhető\nKiváló zajcsillapítás (53-65 dBA), könnyű használat, egyszerű felépítés, minmális karbantartási igény."]
["ABAC sűrítők"]
["CONDOR nyomáskapcsolók"]
["Tartályok"]
["Egyéb alaktrészek"]
[]
[]
[]
[]
[]
[]
[null,null,null,"D"]
[]
[null,null,null,"8 bar",null,null,"Térfogatáram (ISO 1217)\nm3/h","Zaj (dBA)","Névleges motortelj. (kW)",null,"Nettó ár \n-alap gép",null,"Nettó ár hűtveszárító- val",null,"Nettó ár \ntartály 270l",null,"Nettó ár \ntartály 270l + hűtveszárító",null,"Nettó ár \ntartály 500l",null,"Nettó ár \ntartály 270l + hűtveszárító"]
[null,null,null,null,null,null,"8  bar",null,null,null,null,null,null,null,"270l",null,"270l PLUSZ",null,"500l ",null,"500l PLUSZ"]
[null,null,null,"SPR 2",null," 230V / 400V",10.4,53,1.5,null,5200,null,6800,null,5550,null,7150,null,5680,null,7280]
[null,null,null,"SPR 3",null," 230V / 400V",15.1,55,2.2000000000000002,null,5300,null,7000,null,5650,null,7350,null,5780,null,7480]
[null,null,null,"SPR 5",null,"400V",24.1,57,3.7,null,null,null,8900,null,null,null,9250,null,null,null,9380]
[null,null,null,"SPR 8",null,"400V",35.299999999999997,59,5.5,null,8200,null,10700,null,8550,null,11050,null,8680,null,11180]
[null,null,null,"SPR 10",null,"400V",48,63,"2 x 3,7",null,13900,null,15900,null,"NO",null,"NO",null,"NO",null,"NO"]
[null,null,null,"SPR 15",null,"400V",73.2,63,"2 x 5,5",null,18600,null,20600,null,"NO",null,"NO",null,"NO",null,"NO"]
[null,null,null,"SPR 20",null,"400V",95,63,"4 x 3,7",null,23800,null,25800,null,"NO",null,"NO",null,"NO",null,"NO"]
[null,null,null,"SPR 22",null,"400V",111.6,64,"3 x 5,5",null,29800,null,35100,null,"NO",null,"NO",null,"NO",null,"NO"]
[null,null,null,"SPR 30",null,"400V",147,65,"4 x 5,5",null,33600,null,36700,null,"NO",null,"NO",null,"NO",null,"NO"]
[]
[]
[]
[]
[]
[null,null,null,"10 bar",null,null,"Térfogatáram (ISO 1217)\nm3/h","Zaj (dBA)","Névleges motortelj. (kW)",null,"Nettó ár \n-alap gép",null,"Nettó ár hűtveszárító- val",null,"Nettó ár \ntartály 270l",null,"Nettó ár \ntartály 270l + hűtveszárító",null,"Nettó ár \ntartály 500l",null,"Nettó ár \ntartály 270l + hűtveszárító"]
[null,null,null,null,null,null,"10 bar",null,null,null,null,null,null,null,"270l",null,"270l PLUSZ",null,"500l ",null,"500l PLUSZ"]
[null,null,null,"SPR 2",null," 230V / 400V",6.8,53,1.5,null,5700,null,7500,null,6050,null,7850,null,6180,null,7980]
[null,null,null,"SPR 3",null," 230V / 400V",12.2,55,2.2000000000000002,null,5800,null,7600,null,6150,null,7950,null,6280,null,8080]
[null,null,null,"SPR 5",null,null,21.2,57,3.7,null,7200,null,9400,null,7550,null,9750,null,7680,null,9880]
[null,null,null,"SPR 8",null,"400V",27.4,59,5.5,null,8700,null,11200,null,9050,null,11550,null,9180,null,11680]
[null,null,null,"SPR 10",null,"400V",40.799999999999997,63,"2 x 3,7",null,15300,null,17300,null,"NO",null,"NO",null,"NO",null,"NO"]
[null,null,null,"SPR 15",null,"400V",54,63,"2 x 5,5",null,20900,null,23000,null,"NO",null,"NO",null,"NO",null,"NO"]
[null,null,null,"SPR 20",null,"400V",82.8,63,"4 x 3,7",null,26300,null,28500,null,"NO",null,"NO",null,"NO",null,"NO"]
[null,null,null,"SPR 22",null,"400V",85.2,64,"3 x 5,5",null,32200,null,38000,null,"NO",null,"NO",null,"NO",null,"NO"]
[null,null,null,"SPR 30",null,"400V",108,65,"4 x 5,5",null,36300,null,39700,null,"NO",null,"NO",null,"NO",null,"NO"]
[]
[]
[null,null,"ALUP WisAir olajmentes csavarkompresszorok"]
[null,null,"- 100 % olajmentes sűrített levegő"]
[null,null,"- fix és fordulatszám szabályozott kivitelben is elérhető"]
[null,null,"- nagy energia megtakarítási potenciál, a sűrítés közel isothermikus módon"]
[null,null,"- robusztus felépítését és nagyon halk működés"]
[null,null,"- üzembiztonság a minőségi anyagok felhasználása által (bronz, aluötvözet, saválló anyagok)"]
[null,null,"- világos, áttekinthető felépítés, csekély karbantartás"]
[null,null,"- környezetbarát üzemelés"]
[null,null,"- Egyfokozatú, víz befecskendezéses sűrítőfokozat."]
[null,null,"- 60 °C-nal alacsonyabb sűrítési véghőmérséklet"]
[null,null,"- plus-kivitel beépített hűtveszárítóval"]
[]
[]
[]
[]
[]
[]
[]
[]
[]
[]
[]
[]
[]
[]
[]
[]
[]
[]
[]
[]
[]
[]
[]
[]
[]
[null,null,null,"Gép",null,"Térfogatáram (ISO 1217)\nm3/h\nmin","Térfogatáram (ISO 1217)\nm3/h\nmax","Zaj (dBA)","Névleges motortelj. (kW)",null,"A x B x C","Nettó ár alapgép",null,"Tömeg","A x B x C","Nettó ár hűtveszárítóval",null,"Tömeg"]
[null,null,null,null,null,"5 - 13 bar",null,null,null,null,"mm","500l ",null,"kg","mm","500l ",null,"kg"]
[null,null,null,"WIS 20 V",null,78,168,68,15,null,"1976 x 974 x 1500",35200,null,1226,"1976 x 974 x 1500",37600,null,1320]
[null,null,null,"WIS 25 V",null,78,192,69,18,null,null,36300,null,1298,null,39300,null,1298]
[null,null,null,"WIS 30 V",null,78,240,71,22,null,null,37300,null,1321,null,40900,null,1321]
[null,null,null,"WIS 40 V",null,78,300,69,30,null,null,41900,null,1298,null,45400,null,1395]
[null,null,null,"WIS 50 V",null,150,372,71,37,null,"2435 x 965 x 1840",60900,null,1321,"2435 x 965 x 1840",63800,null,1416]
[null,null,null,"WIS 75 V",null,150,556,72,55,null,null,71300,null,1378,null,78400,null,1497]

{"sheet":"Segéd","index":11,"n_rows":38,"n_cols":6,"rows_kept":38,"cut":false,"hidden":true,"merged":[]}
["Pénznem"]
["HUF",1,300]
["EUR",2,1]
["Szállítás"]
["Csomagküldés",1,1]
["Érte jön",2,0.97]
["Kiszállítás",3,1]
["Fizetési mód"]
["KP",1,0.99]
["Banki utalás",2,1]
["Előre utalás",3,0.99]
["Utánvét",4,0.99]
["Kedvezmény"]
["Alap ár",1,{"$f":"IF(ISBLANK(Megrendelő!D9),1,1-Megrendelő!D9)","v":{"$error":"#VALUE!"}}]
[0.2,2,0.8]
[0.21,3,{"$f":"1-A16","v":0.79}]
[0.22,4,{"$f":"1-A17","v":0.78}]
[0.23,5,{"$f":"1-A18","v":0.77},null,null,{"$f":"IFERROR(ROUND(IF(VLOOKUP($A18,ST!$A:$O,17,0)>0,VLOOKUP($A18,ST!$A:$O,17,0),VLOOKUP($A18,ST!$A:$O,15,0))*H$9,-1),\"\")","v":""}]
[0.24,6,{"$f":"1-A19","v":0.76}]
[0.25,7,{"$f":"1-A20","v":0.75}]
["Szállítási mód"]
["Normál"]
["Sűrgősségi"]
["Súly",1.06]
[3,1100,{"$f":"B25*B$24","v":1166}]
[5,1300,{"$f":"B26*B$24","v":1378}]
[10,1400,1484]
[15,1500,1590]
[20,1600,1696]
[25,1900,2014]
[31,2300,2438]
[50,3500,{"$f":"B32*B$24","v":3710}]
[1000,15000,15900]
["Utánvét"]
[50000,400]
[100000,800]
[300000,1500]
[500000,3000]

{"sheet":"ST","index":12,"n_rows":31,"n_cols":13,"rows_kept":31,"cut":false,"hidden":true,"merged":[[0,9,0,10],[0,11,0,12]]}
[null,null,null,null,null,null,null,null,null,"Javasolt eladási árak"]
[null,"Type","Référence","Description",null,null,null,"Súly","Oldal","Listaár","TOPS STARS árak","Webshop","Mennyiség"]
[1,null,{"$f":"IF(COUNTIF(Árlista!$A$3:$A$839,$A3)>0,VLOOKUP($A3,Árlista!$A:$L,2,0),\"\")","v":""},{"$f":"IF(COUNTIF(Árlista!$A$3:$A$839,$A3)>0,VLOOKUP($A3,Árlista!$A:$L,3,0),\"\")","v":""},null,null,{"$f":"IF(COUNTIF(Árlista!$A$3:$A$839,$A3)>0,IF(VLOOKUP($A3,Árlista!$A:$L,8,0)=\"SP\",5%,0),\"\")","v":""},{"$f":"IF(COUNTIF(Árlista!$A$3:$A$839,$A3)>0,VLOOKUP($A3,Árlista!$A:$L,7,0),\"\")","v":""},null,{"$f":"IF(COUNTIF(Árlista!$A$3:$A$839,$A3)>0,VLOOKUP($A3,Árlista!$A:$L,9,0),\"\")","v":""},{"$f":"IF(COUNTIF(Árlista!$A$3:$A$839,$A3)>0,VLOOKUP($A3,Árlista!$A:$L,10,0),\"\")","v":""},{"$f":"IF(COUNTIF(Árlista!$A$3:$A$839,$A3)>0,VLOOKUP($A3,Árlista!$A:$L,11,0),\"\")","v":""},{"$f":"IF(COUNTIF(Árlista!$A$3:$A$839,$A3)>0,VLOOKUP($A3,Árlista!$A:$L,12,0),\"\")","v":""}]
[2,null,{"$f":"IF(COUNTIF(Árlista!$A$3:$A$839,$A4)>0,VLOOKUP($A4,Árlista!$A:$L,2,0),\"\")","v":""},{"$f":"IF(COUNTIF(Árlista!$A$3:$A$839,$A4)>0,VLOOKUP($A4,Árlista!$A:$L,3,0),\"\")","v":""},null,null,{"$f":"IF(COUNTIF(Árlista!$A$3:$A$839,$A4)>0,IF(VLOOKUP($A4,Árlista!$A:$L,8,0)=\"SP\",5%,0),\"\")","v":""},{"$f":"IF(COUNTIF(Árlista!$A$3:$A$839,$A4)>0,VLOOKUP($A4,Árlista!$A:$L,7,0),\"\")","v":""},null,{"$f":"IF(COUNTIF(Árlista!$A$3:$A$839,$A4)>0,VLOOKUP($A4,Árlista!$A:$L,9,0),\"\")","v":""},{"$f":"IF(COUNTIF(Árlista!$A$3:$A$839,$A4)>0,VLOOKUP($A4,Árlista!$A:$L,10,0),\"\")","v":""},{"$f":"IF(COUNTIF(Árlista!$A$3:$A$839,$A4)>0,VLOOKUP($A4,Árlista!$A:$L,11,0),\"\")","v":""},{"$f":"IF(COUNTIF(Árlista!$A$3:$A$839,$A4)>0,VLOOKUP($A4,Árlista!$A:$L,12,0),\"\")","v":""}]
[3,null,{"$f":"IF(COUNTIF(Árlista!$A$3:$A$839,$A5)>0,VLOOKUP($A5,Árlista!$A:$L,2,0),\"\")","v":""},{"$f":"IF(COUNTIF(Árlista!$A$3:$A$839,$A5)>0,VLOOKUP($A5,Árlista!$A:$L,3,0),\"\")","v":""},null,null,{"$f":"IF(COUNTIF(Árlista!$A$3:$A$839,$A5)>0,IF(VLOOKUP($A5,Árlista!$A:$L,8,0)=\"SP\",5%,0),\"\")","v":""},{"$f":"IF(COUNTIF(Árlista!$A$3:$A$839,$A5)>0,VLOOKUP($A5,Árlista!$A:$L,7,0),\"\")","v":""},null,{"$f":"IF(COUNTIF(Árlista!$A$3:$A$839,$A5)>0,VLOOKUP($A5,Árlista!$A:$L,9,0),\"\")","v":""},{"$f":"IF(COUNTIF(Árlista!$A$3:$A$839,$A5)>0,VLOOKUP($A5,Árlista!$A:$L,10,0),\"\")","v":""},{"$f":"IF(COUNTIF(Árlista!$A$3:$A$839,$A5)>0,VLOOKUP($A5,Árlista!$A:$L,11,0),\"\")","v":""},{"$f":"IF(COUNTIF(Árlista!$A$3:$A$839,$A5)>0,VLOOKUP($A5,Árlista!$A:$L,12,0),\"\")","v":""}]
[4,null,{"$f":"IF(COUNTIF(Árlista!$A$3:$A$839,$A6)>0,VLOOKUP($A6,Árlista!$A:$L,2,0),\"\")","v":""},{"$f":"IF(COUNTIF(Árlista!$A$3:$A$839,$A6)>0,VLOOKUP($A6,Árlista!$A:$L,3,0),\"\")","v":""},null,null,{"$f":"IF(COUNTIF(Árlista!$A$3:$A$839,$A6)>0,IF(VLOOKUP($A6,Árlista!$A:$L,8,0)=\"SP\",5%,0),\"\")","v":""},{"$f":"IF(COUNTIF(Árlista!$A$3:$A$839,$A6)>0,VLOOKUP($A6,Árlista!$A:$L,7,0),\"\")","v":""},null,{"$f":"IF(COUNTIF(Árlista!$A$3:$A$839,$A6)>0,VLOOKUP($A6,Árlista!$A:$L,9,0),\"\")","v":""},{"$f":"IF(COUNTIF(Árlista!$A$3:$A$839,$A6)>0,VLOOKUP($A6,Árlista!$A:$L,10,0),\"\")","v":""},{"$f":"IF(COUNTIF(Árlista!$A$3:$A$839,$A6)>0,VLOOKUP($A6,Árlista!$A:$L,11,0),\"\")","v":""},{"$f":"IF(COUNTIF(Árlista!$A$3:$A$839,$A6)>0,VLOOKUP($A6,Árlista!$A:$L,12,0),\"\")","v":""}]
[5,null,{"$f":"IF(COUNTIF(Árlista!$A$3:$A$839,$A7)>0,VLOOKUP($A7,Árlista!$A:$L,2,0),\"\")","v":""},{"$f":"IF(COUNTIF(Árlista!$A$3:$A$839,$A7)>0,VLOOKUP($A7,Árlista!$A:$L,3,0),\"\")","v":""},null,null,{"$f":"IF(COUNTIF(Árlista!$A$3:$A$839,$A7)>0,IF(VLOOKUP($A7,Árlista!$A:$L,8,0)=\"SP\",5%,0),\"\")","v":""},{"$f":"IF(COUNTIF(Árlista!$A$3:$A$839,$A7)>0,VLOOKUP($A7,Árlista!$A:$L,7,0),\"\")","v":""},null,{"$f":"IF(COUNTIF(Árlista!$A$3:$A$839,$A7)>0,VLOOKUP($A7,Árlista!$A:$L,9,0),\"\")","v":""},{"$f":"IF(COUNTIF(Árlista!$A$3:$A$839,$A7)>0,VLOOKUP($A7,Árlista!$A:$L,10,0),\"\")","v":""},{"$f":"IF(COUNTIF(Árlista!$A$3:$A$839,$A7)>0,VLOOKUP($A7,Árlista!$A:$L,11,0),\"\")","v":""},{"$f":"IF(COUNTIF(Árlista!$A$3:$A$839,$A7)>0,VLOOKUP($A7,Árlista!$A:$L,12,0),\"\")","v":""}]
[6,null,{"$f":"IF(COUNTIF(Árlista!$A$3:$A$839,$A8)>0,VLOOKUP($A8,Árlista!$A:$L,2,0),\"\")","v":""},{"$f":"IF(COUNTIF(Árlista!$A$3:$A$839,$A8)>0,VLOOKUP($A8,Árlista!$A:$L,3,0),\"\")","v":""},null,null,{"$f":"IF(COUNTIF(Árlista!$A$3:$A$839,$A8)>0,IF(VLOOKUP($A8,Árlista!$A:$L,8,0)=\"SP\",5%,0),\"\")","v":""},{"$f":"IF(COUNTIF(Árlista!$A$3:$A$839,$A8)>0,VLOOKUP($A8,Árlista!$A:$L,7,0),\"\")","v":""},null,{"$f":"IF(COUNTIF(Árlista!$A$3:$A$839,$A8)>0,VLOOKUP($A8,Árlista!$A:$L,9,0),\"\")","v":""},{"$f":"IF(COUNTIF(Árlista!$A$3:$A$839,$A8)>0,VLOOKUP($A8,Árlista!$A:$L,10,0),\"\")","v":""},{"$f":"IF(COUNTIF(Árlista!$A$3:$A$839,$A8)>0,VLOOKUP($A8,Árlista!$A:$L,11,0),\"\")","v":""},{"$f":"IF(COUNTIF(Árlista!$A$3:$A$839,$A8)>0,VLOOKUP($A8,Árlista!$A:$L,12,0),\"\")","v":""}]
[7,null,{"$f":"IF(COUNTIF(Árlista!$A$3:$A$839,$A9)>0,VLOOKUP($A9,Árlista!$A:$L,2,0),\"\")","v":""},{"$f":"IF(COUNTIF(Árlista!$A$3:$A$839,$A9)>0,VLOOKUP($A9,Árlista!$A:$L,3,0),\"\")","v":""},null,null,{"$f":"IF(COUNTIF(Árlista!$A$3:$A$839,$A9)>0,IF(VLOOKUP($A9,Árlista!$A:$L,8,0)=\"SP\",5%,0),\"\")","v":""},{"$f":"IF(COUNTIF(Árlista!$A$3:$A$839,$A9)>0,VLOOKUP($A9,Árlista!$A:$L,7,0),\"\")","v":""},null,{"$f":"IF(COUNTIF(Árlista!$A$3:$A$839,$A9)>0,VLOOKUP($A9,Árlista!$A:$L,9,0),\"\")","v":""},{"$f":"IF(COUNTIF(Árlista!$A$3:$A$839,$A9)>0,VLOOKUP($A9,Árlista!$A:$L,10,0),\"\")","v":""},{"$f":"IF(COUNTIF(Árlista!$A$3:$A$839,$A9)>0,VLOOKUP($A9,Árlista!$A:$L,11,0),\"\")","v":""},{"$f":"IF(COUNTIF(Árlista!$A$3:$A$839,$A9)>0,VLOOKUP($A9,Árlista!$A:$L,12,0),\"\")","v":""}]
[8,null,{"$f":"IF(COUNTIF(Árlista!$A$3:$A$839,$A10)>0,VLOOKUP($A10,Árlista!$A:$L,2,0),\"\")","v":""},{"$f":"IF(COUNTIF(Árlista!$A$3:$A$839,$A10)>0,VLOOKUP($A10,Árlista!$A:$L,3,0),\"\")","v":""},null,null,{"$f":"IF(COUNTIF(Árlista!$A$3:$A$839,$A10)>0,IF(VLOOKUP($A10,Árlista!$A:$L,8,0)=\"SP\",5%,0),\"\")","v":""},{"$f":"IF(COUNTIF(Árlista!$A$3:$A$839,$A10)>0,VLOOKUP($A10,Árlista!$A:$L,7,0),\"\")","v":""},null,{"$f":"IF(COUNTIF(Árlista!$A$3:$A$839,$A10)>0,VLOOKUP($A10,Árlista!$A:$L,9,0),\"\")","v":""},{"$f":"IF(COUNTIF(Árlista!$A$3:$A$839,$A10)>0,VLOOKUP($A10,Árlista!$A:$L,10,0),\"\")","v":""},{"$f":"IF(COUNTIF(Árlista!$A$3:$A$839,$A10)>0,VLOOKUP($A10,Árlista!$A:$L,11,0),\"\")","v":""},{"$f":"IF(COUNTIF(Árlista!$A$3:$A$839,$A10)>0,VLOOKUP($A10,Árlista!$A:$L,12,0),\"\")","v":""}]
[9,null,{"$f":"IF(COUNTIF(Árlista!$A$3:$A$839,$A11)>0,VLOOKUP($A11,Árlista!$A:$L,2,0),\"\")","v":""},{"$f":"IF(COUNTIF(Árlista!$A$3:$A$839,$A11)>0,VLOOKUP($A11,Árlista!$A:$L,3,0),\"\")","v":""},null,null,{"$f":"IF(COUNTIF(Árlista!$A$3:$A$839,$A11)>0,IF(VLOOKUP($A11,Árlista!$A:$L,8,0)=\"SP\",5%,0),\"\")","v":""},{"$f":"IF(COUNTIF(Árlista!$A$3:$A$839,$A11)>0,VLOOKUP($A11,Árlista!$A:$L,7,0),\"\")","v":""},null,{"$f":"IF(COUNTIF(Árlista!$A$3:$A$839,$A11)>0,VLOOKUP($A11,Árlista!$A:$L,9,0),\"\")","v":""},{"$f":"IF(COUNTIF(Árlista!$A$3:$A$839,$A11)>0,VLOOKUP($A11,Árlista!$A:$L,10,0),\"\")","v":""},{"$f":"IF(COUNTIF(Árlista!$A$3:$A$839,$A11)>0,VLOOKUP($A11,Árlista!$A:$L,11,0),\"\")","v":""},{"$f":"IF(COUNTIF(Árlista!$A$3:$A$839,$A11)>0,VLOOKUP($A11,Árlista!$A:$L,12,0),\"\")","v":""}]
[10,null,{"$f":"IF(COUNTIF(Árlista!$A$3:$A$839,$A12)>0,VLOOKUP($A12,Árlista!$A:$L,2,0),\"\")","v":""},{"$f":"IF(COUNTIF(Árlista!$A$3:$A$839,$A12)>0,VLOOKUP($A12,Árlista!$A:$L,3,0),\"\")","v":""},null,null,{"$f":"IF(COUNTIF(Árlista!$A$3:$A$839,$A12)>0,IF(VLOOKUP($A12,Árlista!$A:$L,8,0)=\"SP\",5%,0),\"\")","v":""},{"$f":"IF(COUNTIF(Árlista!$A$3:$A$839,$A12)>0,VLOOKUP($A12,Árlista!$A:$L,7,0),\"\")","v":""},null,{"$f":"IF(COUNTIF(Árlista!$A$3:$A$839,$A12)>0,VLOOKUP($A12,Árlista!$A:$L,9,0),\"\")","v":""},{"$f":"IF(COUNTIF(Árlista!$A$3:$A$839,$A12)>0,VLOOKUP($A12,Árlista!$A:$L,10,0),\"\")","v":""},{"$f":"IF(COUNTIF(Árlista!$A$3:$A$839,$A12)>0,VLOOKUP($A12,Árlista!$A:$L,11,0),\"\")","v":""},{"$f":"IF(COUNTIF(Árlista!$A$3:$A$839,$A12)>0,VLOOKUP($A12,Árlista!$A:$L,12,0),\"\")","v":""}]
[11,null,{"$f":"IF(COUNTIF(Árlista!$A$3:$A$839,$A13)>0,VLOOKUP($A13,Árlista!$A:$L,2,0),\"\")","v":""},{"$f":"IF(COUNTIF(Árlista!$A$3:$A$839,$A13)>0,VLOOKUP($A13,Árlista!$A:$L,3,0),\"\")","v":""},null,null,{"$f":"IF(COUNTIF(Árlista!$A$3:$A$839,$A13)>0,IF(VLOOKUP($A13,Árlista!$A:$L,8,0)=\"SP\",5%,0),\"\")","v":""},{"$f":"IF(COUNTIF(Árlista!$A$3:$A$839,$A13)>0,VLOOKUP($A13,Árlista!$A:$L,7,0),\"\")","v":""},null,{"$f":"IF(COUNTIF(Árlista!$A$3:$A$839,$A13)>0,VLOOKUP($A13,Árlista!$A:$L,9,0),\"\")","v":""},{"$f":"IF(COUNTIF(Árlista!$A$3:$A$839,$A13)>0,VLOOKUP($A13,Árlista!$A:$L,10,0),\"\")","v":""},{"$f":"IF(COUNTIF(Árlista!$A$3:$A$839,$A13)>0,VLOOKUP($A13,Árlista!$A:$L,11,0),\"\")","v":""},{"$f":"IF(COUNTIF(Árlista!$A$3:$A$839,$A13)>0,VLOOKUP($A13,Árlista!$A:$L,12,0),\"\")","v":""}]
[12,null,{"$f":"IF(COUNTIF(Árlista!$A$3:$A$839,$A14)>0,VLOOKUP($A14,Árlista!$A:$L,2,0),\"\")","v":""},{"$f":"IF(COUNTIF(Árlista!$A$3:$A$839,$A14)>0,VLOOKUP($A14,Árlista!$A:$L,3,0),\"\")","v":""},null,null,{"$f":"IF(COUNTIF(Árlista!$A$3:$A$839,$A14)>0,IF(VLOOKUP($A14,Árlista!$A:$L,8,0)=\"SP\",5%,0),\"\")","v":""},{"$f":"IF(COUNTIF(Árlista!$A$3:$A$839,$A14)>0,VLOOKUP($A14,Árlista!$A:$L,7,0),\"\")","v":""},null,{"$f":"IF(COUNTIF(Árlista!$A$3:$A$839,$A14)>0,VLOOKUP($A14,Árlista!$A:$L,9,0),\"\")","v":""},{"$f":"IF(COUNTIF(Árlista!$A$3:$A$839,$A14)>0,VLOOKUP($A14,Árlista!$A:$L,10,0),\"\")","v":""},{"$f":"IF(COUNTIF(Árlista!$A$3:$A$839,$A14)>0,VLOOKUP($A14,Árlista!$A:$L,11,0),\"\")","v":""},{"$f":"IF(COUNTIF(Árlista!$A$3:$A$839,$A14)>0,VLOOKUP($A14,Árlista!$A:$L,12,0),\"\")","v":""}]
[13,null,{"$f":"IF(COUNTIF(Árlista!$A$3:$A$839,$A15)>0,VLOOKUP($A15,Árlista!$A:$L,2,0),\"\")","v":""},{"$f":"IF(COUNTIF(Árlista!$A$3:$A$839,$A15)>0,VLOOKUP($A15,Árlista!$A:$L,3,0),\"\")","v":""},null,null,{"$f":"IF(COUNTIF(Árlista!$A$3:$A$839,$A15)>0,IF(VLOOKUP($A15,Árlista!$A:$L,8,0)=\"SP\",5%,0),\"\")","v":""},{"$f":"IF(COUNTIF(Árlista!$A$3:$A$839,$A15)>0,VLOOKUP($A15,Árlista!$A:$L,7,0),\"\")","v":""},null,{"$f":"IF(COUNTIF(Árlista!$A$3:$A$839,$A15)>0,VLOOKUP($A15,Árlista!$A:$L,9,0),\"\")","v":""},{"$f":"IF(COUNTIF(Árlista!$A$3:$A$839,$A15)>0,VLOOKUP($A15,Árlista!$A:$L,10,0),\"\")","v":""},{"$f":"IF(COUNTIF(Árlista!$A$3:$A$839,$A15)>0,VLOOKUP($A15,Árlista!$A:$L,11,0),\"\")","v":""},{"$f":"IF(COUNTIF(Árlista!$A$3:$A$839,$A15)>0,VLOOKUP($A15,Árlista!$A:$L,12,0),\"\")","v":""}]
[14,null,{"$f":"IF(COUNTIF(Árlista!$A$3:$A$839,$A16)>0,VLOOKUP($A16,Árlista!$A:$L,2,0),\"\")","v":""},{"$f":"IF(COUNTIF(Árlista!$A$3:$A$839,$A16)>0,VLOOKUP($A16,Árlista!$A:$L,3,0),\"\")","v":""},null,null,{"$f":"IF(COUNTIF(Árlista!$A$3:$A$839,$A16)>0,IF(VLOOKUP($A16,Árlista!$A:$L,8,0)=\"SP\",5%,0),\"\")","v":""},{"$f":"IF(COUNTIF(Árlista!$A$3:$A$839,$A16)>0,VLOOKUP($A16,Árlista!$A:$L,7,0),\"\")","v":""},null,{"$f":"IF(COUNTIF(Árlista!$A$3:$A$839,$A16)>0,VLOOKUP($A16,Árlista!$A:$L,9,0),\"\")","v":""},{"$f":"IF(COUNTIF(Árlista!$A$3:$A$839,$A16)>0,VLOOKUP($A16,Árlista!$A:$L,10,0),\"\")","v":""},{"$f":"IF(COUNTIF(Árlista!$A$3:$A$839,$A16)>0,VLOOKUP($A16,Árlista!$A:$L,11,0),\"\")","v":""},{"$f":"IF(COUNTIF(Árlista!$A$3:$A$839,$A16)>0,VLOOKUP($A16,Árlista!$A:$L,12,0),\"\")","v":""}]
[15,null,{"$f":"IF(COUNTIF(Árlista!$A$3:$A$839,$A17)>0,VLOOKUP($A17,Árlista!$A:$L,2,0),\"\")","v":""},{"$f":"IF(COUNTIF(Árlista!$A$3:$A$839,$A17)>0,VLOOKUP($A17,Árlista!$A:$L,3,0),\"\")","v":""},null,null,{"$f":"IF(COUNTIF(Árlista!$A$3:$A$839,$A17)>0,IF(VLOOKUP($A17,Árlista!$A:$L,8,0)=\"SP\",5%,0),\"\")","v":""},{"$f":"IF(COUNTIF(Árlista!$A$3:$A$839,$A17)>0,VLOOKUP($A17,Árlista!$A:$L,7,0),\"\")","v":""},null,{"$f":"IF(COUNTIF(Árlista!$A$3:$A$839,$A17)>0,VLOOKUP($A17,Árlista!$A:$L,9,0),\"\")","v":""},{"$f":"IF(COUNTIF(Árlista!$A$3:$A$839,$A17)>0,VLOOKUP($A17,Árlista!$A:$L,10,0),\"\")","v":""},{"$f":"IF(COUNTIF(Árlista!$A$3:$A$839,$A17)>0,VLOOKUP($A17,Árlista!$A:$L,11,0),\"\")","v":""},{"$f":"IF(COUNTIF(Árlista!$A$3:$A$839,$A17)>0,VLOOKUP($A17,Árlista!$A:$L,12,0),\"\")","v":""}]
[16,null,{"$f":"IF(COUNTIF(Árlista!$A$3:$A$839,$A18)>0,VLOOKUP($A18,Árlista!$A:$L,2,0),\"\")","v":""},{"$f":"IF(COUNTIF(Árlista!$A$3:$A$839,$A18)>0,VLOOKUP($A18,Árlista!$A:$L,3,0),\"\")","v":""},null,null,{"$f":"IF(COUNTIF(Árlista!$A$3:$A$839,$A18)>0,IF(VLOOKUP($A18,Árlista!$A:$L,8,0)=\"SP\",5%,0),\"\")","v":""},{"$f":"IF(COUNTIF(Árlista!$A$3:$A$839,$A18)>0,VLOOKUP($A18,Árlista!$A:$L,7,0),\"\")","v":""},null,{"$f":"IF(COUNTIF(Árlista!$A$3:$A$839,$A18)>0,VLOOKUP($A18,Árlista!$A:$L,9,0),\"\")","v":""},{"$f":"IF(COUNTIF(Árlista!$A$3:$A$839,$A18)>0,VLOOKUP($A18,Árlista!$A:$L,10,0),\"\")","v":""},{"$f":"IF(COUNTIF(Árlista!$A$3:$A$839,$A18)>0,VLOOKUP($A18,Árlista!$A:$L,11,0),\"\")","v":""},{"$f":"IF(COUNTIF(Árlista!$A$3:$A$839,$A18)>0,VLOOKUP($A18,Árlista!$A:$L,12,0),\"\")","v":""}]
[17,null,{"$f":"IF(COUNTIF(Árlista!$A$3:$A$839,$A19)>0,VLOOKUP($A19,Árlista!$A:$L,2,0),\"\")","v":""},{"$f":"IF(COUNTIF(Árlista!$A$3:$A$839,$A19)>0,VLOOKUP($A19,Árlista!$A:$L,3,0),\"\")","v":""},null,null,{"$f":"IF(COUNTIF(Árlista!$A$3:$A$839,$A19)>0,IF(VLOOKUP($A19,Árlista!$A:$L,8,0)=\"SP\",5%,0),\"\")","v":""},{"$f":"IF(COUNTIF(Árlista!$A$3:$A$839,$A19)>0,VLOOKUP($A19,Árlista!$A:$L,7,0),\"\")","v":""},null,{"$f":"IF(COUNTIF(Árlista!$A$3:$A$839,$A19)>0,VLOOKUP($A19,Árlista!$A:$L,9,0),\"\")","v":""},{"$f":"IF(COUNTIF(Árlista!$A$3:$A$839,$A19)>0,VLOOKUP($A19,Árlista!$A:$L,10,0),\"\")","v":""},{"$f":"IF(COUNTIF(Árlista!$A$3:$A$839,$A19)>0,VLOOKUP($A19,Árlista!$A:$L,11,0),\"\")","v":""},{"$f":"IF(COUNTIF(Árlista!$A$3:$A$839,$A19)>0,VLOOKUP($A19,Árlista!$A:$L,12,0),\"\")","v":""}]
[18,null,{"$f":"IF(COUNTIF(Árlista!$A$3:$A$839,$A20)>0,VLOOKUP($A20,Árlista!$A:$L,2,0),\"\")","v":""},{"$f":"IF(COUNTIF(Árlista!$A$3:$A$839,$A20)>0,VLOOKUP($A20,Árlista!$A:$L,3,0),\"\")","v":""},null,null,{"$f":"IF(COUNTIF(Árlista!$A$3:$A$839,$A20)>0,IF(VLOOKUP($A20,Árlista!$A:$L,8,0)=\"SP\",5%,0),\"\")","v":""},{"$f":"IF(COUNTIF(Árlista!$A$3:$A$839,$A20)>0,VLOOKUP($A20,Árlista!$A:$L,7,0),\"\")","v":""},null,{"$f":"IF(COUNTIF(Árlista!$A$3:$A$839,$A20)>0,VLOOKUP($A20,Árlista!$A:$L,9,0),\"\")","v":""},{"$f":"IF(COUNTIF(Árlista!$A$3:$A$839,$A20)>0,VLOOKUP($A20,Árlista!$A:$L,10,0),\"\")","v":""},{"$f":"IF(COUNTIF(Árlista!$A$3:$A$839,$A20)>0,VLOOKUP($A20,Árlista!$A:$L,11,0),\"\")","v":""},{"$f":"IF(COUNTIF(Árlista!$A$3:$A$839,$A20)>0,VLOOKUP($A20,Árlista!$A:$L,12,0),\"\")","v":""}]
[19,null,{"$f":"IF(COUNTIF(Árlista!$A$3:$A$839,$A21)>0,VLOOKUP($A21,Árlista!$A:$L,2,0),\"\")","v":""},{"$f":"IF(COUNTIF(Árlista!$A$3:$A$839,$A21)>0,VLOOKUP($A21,Árlista!$A:$L,3,0),\"\")","v":""},null,null,{"$f":"IF(COUNTIF(Árlista!$A$3:$A$839,$A21)>0,IF(VLOOKUP($A21,Árlista!$A:$L,8,0)=\"SP\",5%,0),\"\")","v":""},{"$f":"IF(COUNTIF(Árlista!$A$3:$A$839,$A21)>0,VLOOKUP($A21,Árlista!$A:$L,7,0),\"\")","v":""},null,{"$f":"IF(COUNTIF(Árlista!$A$3:$A$839,$A21)>0,VLOOKUP($A21,Árlista!$A:$L,9,0),\"\")","v":""},{"$f":"IF(COUNTIF(Árlista!$A$3:$A$839,$A21)>0,VLOOKUP($A21,Árlista!$A:$L,10,0),\"\")","v":""},{"$f":"IF(COUNTIF(Árlista!$A$3:$A$839,$A21)>0,VLOOKUP($A21,Árlista!$A:$L,11,0),\"\")","v":""},{"$f":"IF(COUNTIF(Árlista!$A$3:$A$839,$A21)>0,VLOOKUP($A21,Árlista!$A:$L,12,0),\"\")","v":""}]
[20,null,{"$f":"IF(COUNTIF(Árlista!$A$3:$A$839,$A22)>0,VLOOKUP($A22,Árlista!$A:$L,2,0),\"\")","v":""},{"$f":"IF(COUNTIF(Árlista!$A$3:$A$839,$A22)>0,VLOOKUP($A22,Árlista!$A:$L,3,0),\"\")","v":""},null,null,{"$f":"IF(COUNTIF(Árlista!$A$3:$A$839,$A22)>0,IF(VLOOKUP($A22,Árlista!$A:$L,8,0)=\"SP\",5%,0),\"\")","v":""},{"$f":"IF(COUNTIF(Árlista!$A$3:$A$839,$A22)>0,VLOOKUP($A22,Árlista!$A:$L,7,0),\"\")","v":""},null,{"$f":"IF(COUNTIF(Árlista!$A$3:$A$839,$A22)>0,VLOOKUP($A22,Árlista!$A:$L,9,0),\"\")","v":""},{"$f":"IF(COUNTIF(Árlista!$A$3:$A$839,$A22)>0,VLOOKUP($A22,Árlista!$A:$L,10,0),\"\")","v":""},{"$f":"IF(COUNTIF(Árlista!$A$3:$A$839,$A22)>0,VLOOKUP($A22,Árlista!$A:$L,11,0),\"\")","v":""},{"$f":"IF(COUNTIF(Árlista!$A$3:$A$839,$A22)>0,VLOOKUP($A22,Árlista!$A:$L,12,0),\"\")","v":""}]
[21,null,{"$f":"IF(COUNTIF(Árlista!$A$3:$A$839,$A23)>0,VLOOKUP($A23,Árlista!$A:$L,2,0),\"\")","v":""},{"$f":"IF(COUNTIF(Árlista!$A$3:$A$839,$A23)>0,VLOOKUP($A23,Árlista!$A:$L,3,0),\"\")","v":""},null,null,{"$f":"IF(COUNTIF(Árlista!$A$3:$A$839,$A23)>0,IF(VLOOKUP($A23,Árlista!$A:$L,8,0)=\"SP\",5%,0),\"\")","v":""},{"$f":"IF(COUNTIF(Árlista!$A$3:$A$839,$A23)>0,VLOOKUP($A23,Árlista!$A:$L,7,0),\"\")","v":""},null,{"$f":"IF(COUNTIF(Árlista!$A$3:$A$839,$A23)>0,VLOOKUP($A23,Árlista!$A:$L,9,0),\"\")","v":""},{"$f":"IF(COUNTIF(Árlista!$A$3:$A$839,$A23)>0,VLOOKUP($A23,Árlista!$A:$L,10,0),\"\")","v":""},{"$f":"IF(COUNTIF(Árlista!$A$3:$A$839,$A23)>0,VLOOKUP($A23,Árlista!$A:$L,11,0),\"\")","v":""},{"$f":"IF(COUNTIF(Árlista!$A$3:$A$839,$A23)>0,VLOOKUP($A23,Árlista!$A:$L,12,0),\"\")","v":""}]
[22,null,{"$f":"IF(COUNTIF(Árlista!$A$3:$A$839,$A24)>0,VLOOKUP($A24,Árlista!$A:$L,2,0),\"\")","v":""},{"$f":"IF(COUNTIF(Árlista!$A$3:$A$839,$A24)>0,VLOOKUP($A24,Árlista!$A:$L,3,0),\"\")","v":""},null,null,{"$f":"IF(COUNTIF(Árlista!$A$3:$A$839,$A24)>0,IF(VLOOKUP($A24,Árlista!$A:$L,8,0)=\"SP\",5%,0),\"\")","v":""},{"$f":"IF(COUNTIF(Árlista!$A$3:$A$839,$A24)>0,VLOOKUP($A24,Árlista!$A:$L,7,0),\"\")","v":""},null,{"$f":"IF(COUNTIF(Árlista!$A$3:$A$839,$A24)>0,VLOOKUP($A24,Árlista!$A:$L,9,0),\"\")","v":""},{"$f":"IF(COUNTIF(Árlista!$A$3:$A$839,$A24)>0,VLOOKUP($A24,Árlista!$A:$L,10,0),\"\")","v":""},{"$f":"IF(COUNTIF(Árlista!$A$3:$A$839,$A24)>0,VLOOKUP($A24,Árlista!$A:$L,11,0),\"\")","v":""},{"$f":"IF(COUNTIF(Árlista!$A$3:$A$839,$A24)>0,VLOOKUP($A24,Árlista!$A:$L,12,0),\"\")","v":""}]
[23,null,{"$f":"IF(COUNTIF(Árlista!$A$3:$A$839,$A25)>0,VLOOKUP($A25,Árlista!$A:$L,2,0),\"\")","v":""},{"$f":"IF(COUNTIF(Árlista!$A$3:$A$839,$A25)>0,VLOOKUP($A25,Árlista!$A:$L,3,0),\"\")","v":""},null,null,{"$f":"IF(COUNTIF(Árlista!$A$3:$A$839,$A25)>0,IF(VLOOKUP($A25,Árlista!$A:$L,8,0)=\"SP\",5%,0),\"\")","v":""},{"$f":"IF(COUNTIF(Árlista!$A$3:$A$839,$A25)>0,VLOOKUP($A25,Árlista!$A:$L,7,0),\"\")","v":""},null,{"$f":"IF(COUNTIF(Árlista!$A$3:$A$839,$A25)>0,VLOOKUP($A25,Árlista!$A:$L,9,0),\"\")","v":""},{"$f":"IF(COUNTIF(Árlista!$A$3:$A$839,$A25)>0,VLOOKUP($A25,Árlista!$A:$L,10,0),\"\")","v":""},{"$f":"IF(COUNTIF(Árlista!$A$3:$A$839,$A25)>0,VLOOKUP($A25,Árlista!$A:$L,11,0),\"\")","v":""},{"$f":"IF(COUNTIF(Árlista!$A$3:$A$839,$A25)>0,VLOOKUP($A25,Árlista!$A:$L,12,0),\"\")","v":""}]
[24,null,{"$f":"IF(COUNTIF(Árlista!$A$3:$A$839,$A26)>0,VLOOKUP($A26,Árlista!$A:$L,2,0),\"\")","v":""},{"$f":"IF(COUNTIF(Árlista!$A$3:$A$839,$A26)>0,VLOOKUP($A26,Árlista!$A:$L,3,0),\"\")","v":""},null,null,{"$f":"IF(COUNTIF(Árlista!$A$3:$A$839,$A26)>0,IF(VLOOKUP($A26,Árlista!$A:$L,8,0)=\"SP\",5%,0),\"\")","v":""},{"$f":"IF(COUNTIF(Árlista!$A$3:$A$839,$A26)>0,VLOOKUP($A26,Árlista!$A:$L,7,0),\"\")","v":""},null,{"$f":"IF(COUNTIF(Árlista!$A$3:$A$839,$A26)>0,VLOOKUP($A26,Árlista!$A:$L,9,0),\"\")","v":""},{"$f":"IF(COUNTIF(Árlista!$A$3:$A$839,$A26)>0,VLOOKUP($A26,Árlista!$A:$L,10,0),\"\")","v":""},{"$f":"IF(COUNTIF(Árlista!$A$3:$A$839,$A26)>0,VLOOKUP($A26,Árlista!$A:$L,11,0),\"\")","v":""},{"$f":"IF(COUNTIF(Árlista!$A$3:$A$839,$A26)>0,VLOOKUP($A26,Árlista!$A:$L,12,0),\"\")","v":""}]
[25,null,{"$f":"IF(COUNTIF(Árlista!$A$3:$A$839,$A27)>0,VLOOKUP($A27,Árlista!$A:$L,2,0),\"\")","v":""},{"$f":"IF(COUNTIF(Árlista!$A$3:$A$839,$A27)>0,VLOOKUP($A27,Árlista!$A:$L,3,0),\"\")","v":""},null,null,{"$f":"IF(COUNTIF(Árlista!$A$3:$A$839,$A27)>0,IF(VLOOKUP($A27,Árlista!$A:$L,8,0)=\"SP\",5%,0),\"\")","v":""},{"$f":"IF(COUNTIF(Árlista!$A$3:$A$839,$A27)>0,VLOOKUP($A27,Árlista!$A:$L,7,0),\"\")","v":""},null,{"$f":"IF(COUNTIF(Árlista!$A$3:$A$839,$A27)>0,VLOOKUP($A27,Árlista!$A:$L,9,0),\"\")","v":""},{"$f":"IF(COUNTIF(Árlista!$A$3:$A$839,$A27)>0,VLOOKUP($A27,Árlista!$A:$L,10,0),\"\")","v":""},{"$f":"IF(COUNTIF(Árlista!$A$3:$A$839,$A27)>0,VLOOKUP($A27,Árlista!$A:$L,11,0),\"\")","v":""},{"$f":"IF(COUNTIF(Árlista!$A$3:$A$839,$A27)>0,VLOOKUP($A27,Árlista!$A:$L,12,0),\"\")","v":""}]
[26,null,{"$f":"IF(COUNTIF(Árlista!$A$3:$A$839,$A28)>0,VLOOKUP($A28,Árlista!$A:$L,2,0),\"\")","v":""},{"$f":"IF(COUNTIF(Árlista!$A$3:$A$839,$A28)>0,VLOOKUP($A28,Árlista!$A:$L,3,0),\"\")","v":""},null,null,{"$f":"IF(COUNTIF(Árlista!$A$3:$A$839,$A28)>0,IF(VLOOKUP($A28,Árlista!$A:$L,8,0)=\"SP\",5%,0),\"\")","v":""},{"$f":"IF(COUNTIF(Árlista!$A$3:$A$839,$A28)>0,VLOOKUP($A28,Árlista!$A:$L,7,0),\"\")","v":""},null,{"$f":"IF(COUNTIF(Árlista!$A$3:$A$839,$A28)>0,VLOOKUP($A28,Árlista!$A:$L,9,0),\"\")","v":""},{"$f":"IF(COUNTIF(Árlista!$A$3:$A$839,$A28)>0,VLOOKUP($A28,Árlista!$A:$L,10,0),\"\")","v":""},{"$f":"IF(COUNTIF(Árlista!$A$3:$A$839,$A28)>0,VLOOKUP($A28,Árlista!$A:$L,11,0),\"\")","v":""},{"$f":"IF(COUNTIF(Árlista!$A$3:$A$839,$A28)>0,VLOOKUP($A28,Árlista!$A:$L,12,0),\"\")","v":""}]
[27,null,{"$f":"IF(COUNTIF(Árlista!$A$3:$A$839,$A29)>0,VLOOKUP($A29,Árlista!$A:$L,2,0),\"\")","v":""},{"$f":"IF(COUNTIF(Árlista!$A$3:$A$839,$A29)>0,VLOOKUP($A29,Árlista!$A:$L,3,0),\"\")","v":""},null,null,{"$f":"IF(COUNTIF(Árlista!$A$3:$A$839,$A29)>0,IF(VLOOKUP($A29,Árlista!$A:$L,8,0)=\"SP\",5%,0),\"\")","v":""},{"$f":"IF(COUNTIF(Árlista!$A$3:$A$839,$A29)>0,VLOOKUP($A29,Árlista!$A:$L,7,0),\"\")","v":""},null,{"$f":"IF(COUNTIF(Árlista!$A$3:$A$839,$A29)>0,VLOOKUP($A29,Árlista!$A:$L,9,0),\"\")","v":""},{"$f":"IF(COUNTIF(Árlista!$A$3:$A$839,$A29)>0,VLOOKUP($A29,Árlista!$A:$L,10,0),\"\")","v":""},{"$f":"IF(COUNTIF(Árlista!$A$3:$A$839,$A29)>0,VLOOKUP($A29,Árlista!$A:$L,11,0),\"\")","v":""},{"$f":"IF(COUNTIF(Árlista!$A$3:$A$839,$A29)>0,VLOOKUP($A29,Árlista!$A:$L,12,0),\"\")","v":""}]
[28,null,{"$f":"IF(COUNTIF(Árlista!$A$3:$A$839,$A30)>0,VLOOKUP($A30,Árlista!$A:$L,2,0),\"\")","v":""},{"$f":"IF(COUNTIF(Árlista!$A$3:$A$839,$A30)>0,VLOOKUP($A30,Árlista!$A:$L,3,0),\"\")","v":""},null,null,{"$f":"IF(COUNTIF(Árlista!$A$3:$A$839,$A30)>0,IF(VLOOKUP($A30,Árlista!$A:$L,8,0)=\"SP\",5%,0),\"\")","v":""},{"$f":"IF(COUNTIF(Árlista!$A$3:$A$839,$A30)>0,VLOOKUP($A30,Árlista!$A:$L,7,0),\"\")","v":""},null,{"$f":"IF(COUNTIF(Árlista!$A$3:$A$839,$A30)>0,VLOOKUP($A30,Árlista!$A:$L,9,0),\"\")","v":""},{"$f":"IF(COUNTIF(Árlista!$A$3:$A$839,$A30)>0,VLOOKUP($A30,Árlista!$A:$L,10,0),\"\")","v":""},{"$f":"IF(COUNTIF(Árlista!$A$3:$A$839,$A30)>0,VLOOKUP($A30,Árlista!$A:$L,11,0),\"\")","v":""},{"$f":"IF(COUNTIF(Árlista!$A$3:$A$839,$A30)>0,VLOOKUP($A30,Árlista!$A:$L,12,0),\"\")","v":""}]
[29,null,{"$f":"IF(COUNTIF(Árlista!$A$3:$A$839,$A31)>0,VLOOKUP($A31,Árlista!$A:$L,2,0),\"\")","v":""},{"$f":"IF(COUNTIF(Árlista!$A$3:$A$839,$A31)>0,VLOOKUP($A31,Árlista!$A:$L,3,0),\"\")","v":""},null,null,{"$f":"IF(COUNTIF(Árlista!$A$3:$A$839,$A31)>0,IF(VLOOKUP($A31,Árlista!$A:$L,8,0)=\"SP\",5%,0),\"\")","v":""},{"$f":"IF(COUNTIF(Árlista!$A$3:$A$839,$A31)>0,VLOOKUP($A31,Árlista!$A:$L,7,0),\"\")","v":""},null,{"$f":"IF(COUNTIF(Árlista!$A$3:$A$839,$A31)>0,VLOOKUP($A31,Árlista!$A:$L,9,0),\"\")","v":""},{"$f":"IF(COUNTIF(Árlista!$A$3:$A$839,$A31)>0,VLOOKUP($A31,Árlista!$A:$L,10,0),\"\")","v":""},{"$f":"IF(COUNTIF(Árlista!$A$3:$A$839,$A31)>0,VLOOKUP($A31,Árlista!$A:$L,11,0),\"\")","v":""},{"$f":"IF(COUNTIF(Árlista!$A$3:$A$839,$A31)>0,VLOOKUP($A31,Árlista!$A:$L,12,0),\"\")","v":""}]

{"sheet":"Tartály","index":13,"n_rows":81,"n_cols":9,"rows_kept":81,"cut":false,"hidden":false,"merged":[[66,6,73,7]]}
["TARTALOM"]
["Árlista"]
["Megrendelő"]
["ABAC dugattyús kompresszorok"]
["ABAC CleanAir fogászati kompresszor"]
["AGRE ipari dugattyús kompresszorok"]
["ALUP SONETTO csavarkomp 2,2-15kW"]
["ALUP SCK csavarkomp 4-75kW"]
["ALUP LARGO, ALLEGRO csavarkompr"]
["ALUP Hűtveszárítók"]
["ALUP szűrők"]
["ALUP SpiralAir -Scroll kompresszor"]
["ALUP dugattyús kompresszorok"]
["OMEGA vonali szűrők"]
["OMEGA ciklonszűrők"]
["OMEGA olaj-víz szétválasztók",null,null,"Tartály mérete","Típus","Felületkezelés","Tömeg","Méret (SZxMxH)","Nettó ár Ft"]
["ABAC sűrítők",null,1,"90 liter / 11 bar","Fekvő","Festve,csomagolva",45,"0,4x0,7x1,1",84000]
["CONDOR nyomáskapcsolók",null,2,"150 liter / 11 bar","Álló","Festve,csomagolva",69,"0,5x0,7x1,6",100000]
["Tartályok",null,3,"150 liter / 11 bar","Fekvő","Festve,csomagolva",75,"0,5x0,6x1,4",112000]
["Egyéb alaktrészek",null,4,"250 liter / 11 bar","Álló","Festve,csomagolva",90,"0,7x0,9x1,3",126000]
[null,null,5,"250 liter / 11 bar","Fekvő","Festve,csomagolva",95,"0,7x1,0x1,3",144000]
[null,null,6,"250 liter / 16 bar","Álló","Festve,csomagolva",116,"0,7x0,9x1,3",138000]
[null,null,7,"250 liter / 16 bar","Fekvő","Festve,csomagolva",125,"0,7x1,0x1,3",178000]
[null,null,8,"270 liter / 11 bar","Álló","Festve,csomagolva",88,"0,6x0,8x1,8",120000]
[null,null,9,"270 liter / 11 bar","Fekvő","Festve,csomagolva",90,"0,6x0,9x1,8",138000]
[null,null,10,"350 liter / 11 bar","Álló","Festve,csomagolva",112,"0,7x0,9x1,5",146000]
[null,null,11,"350 liter / 11 bar","Fekvő","Festve,csomagolva",120,"0,7x1,0x1,4",167000]
[null,null,12,"350 liter / 16 bar","Álló","Festve,csomagolva",140,"0,7x0,9x1,5",157000]
[null,null,13,"350 liter /16 bar","Fekvő","Festve,csomagolva",150,"0,7x1,0x1,4",189000]
[null,null,14,"500 liter / 11 bar","Álló","Festve,csomagolva",148,"0,8x0,9x2,1",165000]
[null,null,15,"500 liter / 11 bar","Álló","Tűzihorganyozva",148,"0,8x0,9x2,1",257000]
[null,null,16,"500 liter / 11 bar","Fekvő","Festve,csomagolva",157,"0,8x0,9x1,9",197000]
[null,null,17,"500 liter / 16 bar","Álló","Festve,csomagolva",187,"0,8x0,9x2,1",240000]
[null,null,18,"500 liter / 16 bar","Fekvő","Festve,csomagolva",196,"0,8x0,9x1,9",284000]
[null,null,19,"750 liter / 11 bar","Álló","Festve,csomagolva",225,"0,9x1,0x2,1",220000]
[null,null,20,"750 liter / 11 bar","Fekvő","Festve,csomagolva",232,"0,9x1,1x2,0",250000]
[null,null,21,"750 liter / 16 bar","Álló","Festve,csomagolva",200,"0,9x1,0x1,9",267000]
[null,null,22,"750 liter / 16 bar","Fekvő","Festve,csomagolva",210,"0,9x1,2x1,7",378000]
[null,null,null,"900 liter / 11 bar","Álló","Festve, csomagolva",254,"0,9x1,0x2,3",250000]
[null,null,23,"900 liter / 11 bar","Álló","Festve, csomagolva",254,"0,9x1,0x2,3",324000]
[null,null,null,"900 liter / 11 bar","Álló","Festve, csomagolva",254,"0,9x1,0x2,3",275000]
[null,null,24,"1000 liter / 11 bar","Álló","Festve,csomagolva",220,"0,9x1,0x2,5",250000]
[null,null,25,"1000 liter / 11 bar","Álló","Tűzihorganyozva",220,"0,9x1,0x2,5",392000]
[null,null,26,"1000 liter / 16 bar","Álló","Festve,csomagolva",285,"0,9x1,0x2,5",311000]
[null,null,27,"1000 liter / 16 bar","Álló","Tűzihorganyozva",285,"0,9x1,0x2,5",439000]
[null,null,28,"1500 liter / 11 bar","Álló","Festve,csomagolva",330,"1,1x1,2x2,5",371000]
[null,null,29,"1500 liter / 11 bar","Álló","Tűzihorganyozva",330,"1,1x1,2x2,5",520000]
[null,null,30,"1500 liter / 16 bar","Álló","Festve,csomagolva",420,"1,1x1,2x2,5",443000]
[null,null,31,"2000 liter / 11 bar","Álló","Festve,csomagolva",410,"1,2x1,3x2,5",432000]
[null,null,32,"2000 liter / 11 bar","Álló","Tűzihorganyozva",410,"1,2x1,3x2,5",756000]
[null,null,33,"2000 liter / 16 bar","Álló","Festve,csomagolva",540,"1,2x1,3x2,5",532000]
[null,null,34,"3000 liter / 11 bar","Álló","Festve,csomagolva",580,"1,2x1,3x3,5",537000]
[null,null,35,"3000 liter / 11 bar","Álló","Tűzihorganyozva",580,"1,2x1,3x3,5",910000]
[null,null,36,"3000 liter / 11 bar","Álló","Festve,csomagolva",620,"1,3x1,4x3,1",500000]
[null,null,37,"3000 liter / 16 bar","Álló","Festve,csomagolva",750,"1,2x1,3x3,5",614000]
[null,null,38,"4000 liter / 11 bar","Álló","Festve,csomagolva",900,"1,5x1,6x3,2",878000]
[null,null,39,"5000 liter / 11 bar","Álló","Festve,csomagolva",1200,"1,5x1,6x3,8",945000]
[null,null,40,"5000 liter / 11 bar","Álló","Tűzihorganyozva",1200,"1,5x1,6x3,8",1526000]
[null,null,41,"6000 liter / 11 bar","Álló","Festve,csomagolva",1400,"1,7x1,8x3,5",1343000]
[null,null,42,"8000 liter / 11 bar","Álló","Festve,csomagolva",1750,"1,7x1,8x4,7",1512000]
[null,null,43,"10000 liter / 11 bar","Álló","Festve,csomagolva",2100,"1,7x1,8x5,5",1742000]
[null,null,null,"Tartályok alapkivitelben belső felületkezelés nélkül készülnek"]
[null,null,null,"Az árak 1500 l-ig 1db kémlelőnyílással, 1500-4000 l-ig 2db kezelőnyílással"]
[null,null,null,"4000 l-től búvó nyílással készülnek"]
[null,null,null,"Biztonsági szelepek:"]
[null,null,null,"Bizt szelep méret","Típus","Lefúvás m3/h",null,null,"Nettó ár Ft"]
[null,null,null,"1/4\"",6205,158,"Rendszerben lévő kompresszorok összes légszállítása fölé kell méretezni!",null,18900]
[null,null,null,"1/2\"",6205,463,null,null,23200]
[null,null,null,"3/4\"",6205,970,null,null,27700]
[null,null,null,"1\"",6205,1396,null,null,34400]
[null,null,null,"5/4\"",6205,1724,null,null,41200]
[null,null,null,"5/4\"",6217,3036,null,null,63500]
[null,null,null,"6/4\"",6217,4833,null,null,86400]
[null,null,null,"2\"",6217,7224,null,null,120200]
[]
[null,null,null,"Nyomásmérő óra (kalibrált): ø 100-160 mm",null,null,null,null,14200]
[null,null,null,"Háromállású szelep:",null,null,null,null,9500]
[null,null,null,"Szállítási költség:",null,null,null,null,25000]
[null,null,null,"Idővezérelt leürítő ",null,null,null,null,20000]
[null,null,null,"A tartályok CE jelöléssel vannak ellátva"]
[null,null,null,"Az árak a szállítási költséget és az ÁFA-t nem tartalmazzák!"]

{"sheet":"OMEGA CKL-B ciklon","index":14,"n_rows":66,"n_cols":36,"rows_kept":66,"cut":false,"hidden":false,"merged":[[55,6,55,10],[65,2,65,3],[65,12,65,13],[58,2,58,3],[60,2,60,3],[61,2,61,3],[63,2,64,3],[63,12,63,13],[64,12,64,13],[57,2,57,3],[45,2,47,2],[45,3,46,3],[45,4,47,4],[45,5,47,5],[45,6,47,10],[51,6,51,10],[52,6,52,10],[53,6,53,10],[54,6,54,10],[29,13,30,13],[50,6,50,10],[45,11,47,11],[45,12,47,12],[45,13,47,13],[48,6,48,10],[49,6,49,10],[0,2,1,3],[29,14,31,14],[29,15,31,15],[40,2,40,13],[42,2,44,4],[29,2,31,2],[29,3,30,3],[29,4,30,4],[29,5,30,6],[29,7,30,8],[29,9,30,12]]}
["TARTALOM",null,"CKL-B series"]
["Árlista"]
["Megrendelő"]
["ABAC dugattyús kompresszorok"]
["ABAC CleanAir fogászati kompresszor"]
["AGRE ipari dugattyús kompresszorok"]
["ALUP SONETTO csavarkomp 2,2-15kW"]
["ALUP SCK csavarkomp 4-75kW"]
["ALUP LARGO, ALLEGRO csavarkompr"]
["ALUP Hűtveszárítók"]
["ALUP szűrők"]
["ALUP SpiralAir -Scroll kompresszor"]
["ALUP dugattyús kompresszorok"]
["OMEGA vonali szűrők"]
["OMEGA ciklonszűrők"]
["OMEGA olaj-víz szétválasztók"]
["ABAC sűrítők"]
["CONDOR nyomáskapcsolók",null,null,null,null,null,null,null,null,null,null,null,null,null,null,null,"INDEX "]
["Tartályok"]
["Egyéb alaktrészek"]
[]
[]
[]
[]
[]
[]
[]
[]
[null,null,"SZŰRŐ HÁZ",null,null,null,null,null,null,null,null,null,null,null,null,null,null,null,null,null,"KORREKCIÓS FAKTOR"]
[null,null,"Szűrő \nház\nméret","Cső\n méret","Max.üz.\n nyomás","Átáramlási képesség \nat 7 bar(g), 20 °C",null,"Temperature\nüz. Range",null,"Méretek",null,null,null,"Tömeg","Szűrő \nbetét\ntípus","Nettó ár\n(Csak szűrőház)\n[HUF]",null,null,null,null,"Üzemi nyomás [bar]",2,3,4,5,6,7,8,9,10,11,12,13,14,15,16]
[null,null,null,null,null,null,null,null,null,null,null,null,null,null,null,null,null,null,null,null,"Üzemi nyomás [psi]",29,44,58,72,87,100,115,130,145,160,174,189,203,218,232]
[null,null,null,"inch","bar/psi","Nm³/h","scfm","°C","°F","A [mm]","B [mm]","C [mm]","D [mm]","kg",null,null,null,null,null,null,"Korrekciós faktor",0.38,0.5,0.63,0.75,0.88,1,1.1299999999999999,1.25,1.38,1.5,1.63,1.75,1.88,2,2.13]
[null,null,"CKL 005 B","3/8","16/232",120,70,"1,5 - 65","35 - 149",187,88,20,60,0.7,6050,{"$f":"VLOOKUP(C33,Árlista!$B:$F,3,0)","v":"13 930,-Ft "}]
[null,null,"CKL 007 B","1/2","16/232",155,91,"1,5 - 65","35 - 149",187,88,20,60,0.7,7050,{"$f":"VLOOKUP(C34,Árlista!$B:$F,3,0)","v":"15 670,-Ft "}]
[null,null,"CKL 010 B","3/4","16/232",235,138,"1,5 - 65","35 - 149",257,88,20,80,0.8,14050,{"$f":"VLOOKUP(C35,Árlista!$B:$F,3,0)","v":"18 470,-Ft "}]
[null,null,"CKL 018 B","1","16/232",365,215,"1,5 - 65","35 - 149",263,125,32,100,1.8,12075,{"$f":"VLOOKUP(C36,Árlista!$B:$F,3,0)","v":"26 470,-Ft "}]
[null,null,"CKL 047 B","1 1/2","16/232",770,452,"1,5 - 65","35 - 149",461,125,32,140,2.5,32075,{"$f":"VLOOKUP(C37,Árlista!$B:$F,3,0)","v":"33 110,-Ft "}]
[null,null,"CKL 094 B","2","16/232",1280,753,"1,5 - 65","35 - 149",684,163,43,520,5.0999999999999996,51090,{"$f":"VLOOKUP(C38,Árlista!$B:$F,3,0)","v":"67 910,-Ft "}]
[null,null,"CKL 150 B","2 1/2","16/232",2460,1447,"1,5 - 65","35 - 149",684,163,43,520,5.0999999999999996,76090,{"$f":"VLOOKUP(C39,Árlista!$B:$F,3,0)","v":"82 420,-Ft "}]
[null,null,"CKL 200 B","3","16/232",2850,1677,"1,5 - 65","35 - 149",795,240,59,630,12.9,51140,{"$f":"VLOOKUP(C40,Árlista!$B:$F,3,0)","v":"163 040,-Ft "}]
[null,null,"MEGJEGYZÉS\n- Ár, csak a szűrőházra vonatkozik!"]
[]
[null,null,"SZŰRŐ BETÉT"]
[null,null,null,null,null,"CKL-B"]
[null,null,null,null,null,"szeparátor"]
[null,null,"Szűrő \nbetét \ntípus","Átáramlási képesség","Corresponding\nház","Nettó \nÁr\n[HUF]"]
[]
[null,null,null,"[Nm³/h]"]
[null,null,6050,120,"CKL 005 B",{"$f":"VLOOKUP($C49&F$44,Árlista!$B:$F,3,0)","v":"5 720,-Ft "}]
[null,null,7050,155,"CKL 007 B",{"$f":"VLOOKUP($C50&F$44,Árlista!$B:$F,3,0)","v":"5 720,-Ft "}]
[null,null,14050,235,"CKL 010 B",{"$f":"VLOOKUP($C51&F$44,Árlista!$B:$F,3,0)","v":"7 060,-Ft "}]
[null,null,12075,365,"CKL 018 B",{"$f":"VLOOKUP($C52&F$44,Árlista!$B:$F,3,0)","v":"8 610,-Ft "}]
[null,null,32075,770,"CKL 047 B",{"$f":"VLOOKUP($C53&F$44,Árlista!$B:$F,3,0)","v":"10 070,-Ft "}]
[null,null,51090,1280,"CKL 094 B",{"$f":"VLOOKUP($C54&F$44,Árlista!$B:$F,3,0)","v":"21 170,-Ft "}]
[null,null,76090,2460,"CKL 150 B",{"$f":"VLOOKUP($C55&F$44,Árlista!$B:$F,3,0)","v":"21 170,-Ft "}]
[null,null,51140,2850,"CKL 200 B",{"$f":"VLOOKUP($C56&F$44,Árlista!$B:$F,3,0)","v":"43 880,-Ft "}]
[]
[null,null,"KONDENZÁTUM \nLEERESZTŐ",null,"AOK16B","AOK 20B","TD 16M","CDI 16B","ECD 15B","ECD 40B","ECD 90B","ECD 150B","EMD 12","EMD 12A"]
[null,null,"Nettó ár [HUF]",null,{"$f":"VLOOKUP(E58,Árlista!$B:$F,3,0)","v":"7 060,-Ft "},{"$f":"VLOOKUP(F58,Árlista!$B:$F,3,0)","v":"11 130,-Ft "},{"$f":"VLOOKUP(G58,Árlista!$B:$F,3,0)","v":"21 150,-Ft "},{"$f":"VLOOKUP(H58,Árlista!$B:$F,3,0)","v":"39 520,-Ft "},{"$f":"VLOOKUP(I58,Árlista!$B:$F,3,0)","v":"46 160,-Ft "},{"$f":"VLOOKUP(J58,Árlista!$B:$F,3,0)","v":"47 100,-Ft "},{"$f":"VLOOKUP(K58,Árlista!$B:$F,3,0)","v":"47 720,-Ft "},{"$f":"VLOOKUP(L58,Árlista!$B:$F,3,0)","v":"58 200,-Ft "},{"$f":"VLOOKUP(M58,Árlista!$B:$F,3,0)","v":"33 630,-Ft "},{"$f":"VLOOKUP(N58,Árlista!$B:$F,3,0)","v":"36 290,-Ft "}]
[]
[null,null,null,null,"EMD 12C","EMD 25","EMD 75","EMD 12 Vac","EMD 12A Vac","EMD 12A Vdc","IED"]
[null,null,null,null,{"$f":"VLOOKUP(E61,Árlista!$B:$F,3,0)","v":"39 470,-Ft "},{"$f":"VLOOKUP(F61,Árlista!$B:$F,3,0)","v":"41 930,-Ft "},{"$f":"VLOOKUP(G61,Árlista!$B:$F,3,0)","v":"43 120,-Ft "},{"$f":"VLOOKUP(H61,Árlista!$B:$F,3,0)","v":"40 550,-Ft "},{"$f":"VLOOKUP(I61,Árlista!$B:$F,3,0)","v":"46 750,-Ft "},{"$f":"VLOOKUP(J61,Árlista!$B:$F,3,0)","v":"43 830,-Ft "},{"$f":"VLOOKUP(K61,Árlista!$B:$F,3,0)","v":"24 110,-Ft "}]
[]
[null,null,"KIEGÉSZÍTŐK ",null,"CKL 005 B - CKL 200 B","Vent for AOK 20B"]
[null,null,null,null,"SG","Nipple"]
[null,null,"Nettó ár [HUF]",null,{"$f":"VLOOKUP(E65,Árlista!$B:$F,3,0)","v":"4 500,-Ft "},{"$f":"VLOOKUP(F65,Árlista!$B:$F,3,0)","v":"4 810,-Ft "}]

{"sheet":"OMEGA AF szűrők","index":15,"n_rows":138,"n_cols":34,"rows_kept":138,"cut":false,"hidden":false,"merged":[[82,2,82,3],[82,4,82,5],[82,6,82,7],[73,2,73,3],[74,2,74,3],[76,2,77,3],[80,2,81,3],[80,4,80,5],[80,6,80,7],[81,4,81,5],[81,6,81,7],[76,12,76,13],[77,12,77,13],[78,2,78,3],[78,12,78,13],[51,12,53,12],[51,13,53,13],[67,2,67,3],[68,2,68,3],[70,2,70,3],[71,2,71,3],[51,2,53,2],[51,3,52,3],[51,4,53,4],[51,5,53,5],[51,6,53,10],[51,11,53,11],[44,2,44,13],[46,2,48,4],[49,5,50,5],[49,6,50,6],[49,7,50,9],[49,10,49,12],[50,10,50,11],[0,2,1,3],[28,2,28,13],[29,2,31,2],[29,3,30,3],[29,4,30,4],[29,5,30,6],[29,7,30,10],[29,11,30,11],[29,12,31,12],[29,13,31,13]]}
["TARTALOM",null,"AF series"]
["Árlista"]
["Megrendelő"]
["ABAC dugattyús kompresszorok",null,null,null,null,null,null,null,null,null,null,null,null,null,null,null,"INDEX "]
["ABAC CleanAir fogászati kompresszor"]
["AGRE ipari dugattyús kompresszorok"]
["ALUP SONETTO csavarkomp 2,2-15kW"]
["ALUP SCK csavarkomp 4-75kW"]
["ALUP LARGO, ALLEGRO csavarkompr"]
["ALUP Hűtveszárítók"]
["ALUP szűrők"]
["ALUP SpiralAir -Scroll kompresszor"]
["ALUP dugattyús kompresszorok"]
["OMEGA vonali szűrők"]
["OMEGA ciklonszűrők"]
["OMEGA olaj-víz szétválasztók"]
["ABAC sűrítők"]
["CONDOR nyomáskapcsolók"]
["Tartályok"]
["Egyéb alaktrészek"]
[]
[]
[]
[]
[]
[]
[]
[]
[null,null,"SZŰRŐ HÁZ",null,null,null,null,null,null,null,null,null,null,null,null,null,null,null,"KORREKCIÓS FAKTOR"]
[null,null,"Szűrő \nház\nméret","Cső\n méret","Max.üz.\n nyomás","Átáramlási képesség \nat 7 bar(g), 20 °C",null,"Méretek",null,null,null,"Tömeg","Szűrő \nbetét\ntípus","Nettó ár\n(Csak szűrőház)\n[HUF]",null,null,null,null,"Üzemi nyomás [bar]",2,3,4,5,6,7,8,9,10,11,12,13,14,15,16]
[null,null,null,null,null,null,null,null,null,null,null,null,null,null,null,null,null,null,"Üzemi nyomás [psi]",29,44,58,72,87,100,115,130,145,160,174,189,203,218,232]
[null,null,null,"inch","bar/psi","Nm³/h","scfm","A [mm]","B [mm]","C [mm]","D [mm]","kg",null,null,null,null,null,null,"Korrekciós faktor",0.38,0.5,0.63,0.75,0.88,1,1.1299999999999999,1.25,1.38,1.5,1.63,1.75,1.88,2,2.13]
[null,null,"AF 0056","3/8’’","16/232",60,35,187,88,20,60,0.7,"06050",{"$f":"VLOOKUP(C33,Árlista!$B:$F,3,0)","v":"13 930,-Ft "},null,null,null,null,null,"AF 0106",{"$f":"VLOOKUP($T$33,$C$33:$M$44,2,0)","v":"3/4’’"},{"$f":"VLOOKUP($T$33,$C$33:$M$44,3,0)","v":"16/232"},16,{"$f":"VLOOKUP($T$33,$C$33:$M$44,4,0)","v":120},{"$f":"VLOOKUP($T$33,$C$33:$M$44,6,0)","v":257},{"$f":"VLOOKUP($T$33,$C$33:$M$44,7,0)","v":88},{"$f":"VLOOKUP($T$33,$C$33:$M$44,8,0)","v":20},{"$f":"VLOOKUP($T$33,$C$33:$M$44,9,0)","v":80},{"$f":"VLOOKUP($T$33,$C$33:$M$44,10,0)","v":0.8},{"$f":"VLOOKUP($T$33,$C$33:$M$44,11,0)","v":14050}]
[null,null,"AF 0076","1/2’’","16/232",78,46,187,88,20,60,0.7,"07050",{"$f":"VLOOKUP(C34,Árlista!$B:$F,3,0)","v":"15 670,-Ft "}]
[null,null,"AF 0106","3/4’’","16/232",120,70,257,88,20,80,0.8,14050,{"$f":"VLOOKUP(C35,Árlista!$B:$F,3,0)","v":"18 470,-Ft "},null,null,null,null,null,"Cikkszám :"]
[null,null,"AF 0186","1’’","16/232",198,116,263,125,32,100,1.8,12075,{"$f":"VLOOKUP(C36,Árlista!$B:$F,3,0)","v":"26 470,-Ft "},null,null,null,null,null,"Termék megnevezése:",{"$f":"T33","v":"AF 0106"}]
[null,null,"AF 0306","1’’","16/232",335,197,363,125,32,120,2.5,22075,{"$f":"VLOOKUP(C37,Árlista!$B:$F,3,0)","v":"28 030,-Ft "},null,null,null,null,null,"Csatlakozási méret:",{"$f":"U33","v":"3/4’’"}]
[null,null,"AF 0476","1 1/2’’","16/232",510,300,461,125,32,140,2.5,32075,{"$f":"VLOOKUP(C38,Árlista!$B:$F,3,0)","v":"33 110,-Ft "},null,null,null,null,null,"Max üzemi nyomás :",{"$f":"V33&\" bar/psi\"","v":"16/232 bar/psi"}]
[null,null,"AF 0706","1 1/2’’","16/232",780,459,640,125,32,160,3.2,50075,{"$f":"VLOOKUP(C39,Árlista!$B:$F,3,0)","v":"39 520,-Ft "},null,null,null,null,null,"Átbocsátó képesség (7 bar nyomáson) : ",{"$f":"X33&\" Nm³/h\"","v":"120 Nm³/h"}]
[null,null,"AF 0946","2’’","16/232",1000,588,684,163,43,520,5.0999999999999996,51090,{"$f":"VLOOKUP(C40,Árlista!$B:$F,3,0)","v":"67 910,-Ft "},null,null,null,null,null,"Korrekciós faktor (5 bar) :",0.75]
[null,null,"AF 1506","2’’","16/232",1500,882,935,163,43,770,7.1,76090,{"$f":"VLOOKUP(C41,Árlista!$B:$F,3,0)","v":"82 420,-Ft "},null,null,null,null,null,"Korrekciós faktor (10 bar) :",1.38]
[null,null,"AF 1756","2 1/2’’","16/232",1680,990,935,163,43,770,6.9,76090,{"$f":"VLOOKUP(C42,Árlista!$B:$F,3,0)","v":"135 210,-Ft "},null,null,null,null,null,"Korrekciós faktor (15 bar): ",2]
[null,null,"AF 2006",3,"16/232",2160,1270,795,240,59,630,12.9,51140,{"$f":"VLOOKUP(C43,Árlista!$B:$F,3,0)","v":"163 040,-Ft "},null,null,null,null,null,"A méret (magasság) :",{"$f":"Y33&\" mm\"","v":"257 mm"}]
[null,null,"AF 2406",3,"16/232",2760,1620,1000,240,59,780,14,75140,{"$f":"VLOOKUP(C44,Árlista!$B:$F,3,0)","v":"201 360,-Ft "},null,null,null,null,null,"B méret (beépítési szélesség) :",{"$f":"Z33&\" mm\"","v":"88 mm"}]
[null,null,"MEGJEGYZÉS\n- B filter betét tisztítható ultrahangos tisztítással vagy kifúvatással. A tisztítás gyakorisága a felhasználás függvénye. Ha szükséges, akkor cserélje új szűrőbetétre.\n- Szűrő betéteket  ’’A, A2, H2’’ rendszeresen kell cserélni a felhasználás függvényében, de legkevesebb 6 havonként. Aktívszén szűrő nem működik olajjal telített állapotban! ",null,null,null,null,null,null,null,null,null,null,null,null,null,null,null,null,"C méret  :",{"$f":"AA33&\" mm\"","v":"20 mm"}]
[null,null,null,null,null,null,null,null,null,null,null,null,null,null,null,null,null,null,null,"D méret (minimális szerelési magasság) :",{"$f":"AB33&\" mm\"","v":"80 mm"}]
[null,null,"SZŰRŐ BETÉT",null,null,"15 µm","3 µm","1 µm","0,1 µm","0,01 µm",null,null,null,null,null,null,null,null,null,"Tömeg :",{"$f":"AC33&\" kg\"","v":"0,8 kg"}]
[null,null,null,null,null,"B","P","R","M","S","A","A²","H²","MS²",null,null,null,null,null,"Szűrőbetét típusa :",{"$f":"AD33","v":14050}]
[null,null,null,null,null,"előszűrő","előszűrő","előszűrő","mikroszűrő","finomszűrő","act. carbon","adsorption","catalyst","adsorption",null,null,null,null,null,"Üzemi hőmérsékleti tartomány :"," 1,5 - 65 °C"]
[null,null,null,null,null,"sintered brass","acrylic fibers, \ncellulose","borosilicate micro fibres",null,null,"borosilicate micro fibres"]
[null,null,null,null,null,null,null,null,null,null,"activated carbon",null,"hopcalite"]
[null,null,"Szűrő \nbetét \ntípus","Átáramlási képesség","Corresponding\nház","Nettó \nÁr\n[HUF]","Nettó \nÁr\n[HUF]",null,null,null,null,"Nettó \nÁr\n[HUF]","Nettó \nÁr\n[HUF]","Nettó \nÁr\n[HUF]"]
[null,null,null,null,null,null,null,null,null,null,null,null,null,null,null,null,null,null,null,"14050"]
[null,null,null,"[Nm³/h]",null,null,null,null,null,null,null,null,null,null,null,null,null,null,null,null,null,null,null,"B","P","R","M","S","A"]
[null,null,6050,60,"AF 0056",{"$f":"VLOOKUP($C55&F$48,Árlista!$B:$F,3,0)","v":"6 790,-Ft "},{"$f":"VLOOKUP($C55&G$48,Árlista!$B:$F,3,0)","v":"5 900,-Ft "},{"$f":"VLOOKUP($C55&H$48,Árlista!$B:$F,3,0)","v":"5 900,-Ft "},{"$f":"VLOOKUP($C55&I$48,Árlista!$B:$F,3,0)","v":"5 900,-Ft "},{"$f":"VLOOKUP($C55&J$48,Árlista!$B:$F,3,0)","v":"5 900,-Ft "},{"$f":"VLOOKUP($C55&K$48,Árlista!$B:$F,3,0)","v":"5 900,-Ft "},"-","-","-",null,null,null,null,null,"Cikkszám :"]
[null,null,7050,78,"AF 0076",{"$f":"VLOOKUP($C56&F$48,Árlista!$B:$F,3,0)","v":"8 400,-Ft "},{"$f":"VLOOKUP($C56&G$48,Árlista!$B:$F,3,0)","v":"7 300,-Ft "},{"$f":"VLOOKUP($C56&H$48,Árlista!$B:$F,3,0)","v":"7 300,-Ft "},{"$f":"VLOOKUP($C56&I$48,Árlista!$B:$F,3,0)","v":"7 300,-Ft "},{"$f":"VLOOKUP($C56&J$48,Árlista!$B:$F,3,0)","v":"7 300,-Ft "},{"$f":"VLOOKUP($C56&K$48,Árlista!$B:$F,3,0)","v":"7 300,-Ft "},{"$f":"VLOOKUP($C56&L$48,Árlista!$B:$F,3,0)","v":"21 150,-Ft "},{"$f":"VLOOKUP($C56&M$48,Árlista!$B:$F,3,0)","v":"24 310,-Ft "},{"$f":"VLOOKUP($C56&N$48,Árlista!$B:$F,3,0)","v":"22 070,-Ft "},null,null,null,null,null,"Termék megnevezése :","14050 A",null,null,{"$f":"$T53&\" \"&X54","v":"14050 B"},{"$f":"$T53&\" \"&Y54","v":"14050 P"},"14050 R","14050 M","14050 S","14050 A"]
[null,null,14050,120,"AF 0106",{"$f":"VLOOKUP($C57&F$48,Árlista!$B:$F,3,0)","v":"10 830,-Ft "},{"$f":"VLOOKUP($C57&G$48,Árlista!$B:$F,3,0)","v":"9 400,-Ft "},{"$f":"VLOOKUP($C57&H$48,Árlista!$B:$F,3,0)","v":"9 400,-Ft "},{"$f":"VLOOKUP($C57&I$48,Árlista!$B:$F,3,0)","v":"9 400,-Ft "},{"$f":"VLOOKUP($C57&J$48,Árlista!$B:$F,3,0)","v":"9 400,-Ft "},{"$f":"VLOOKUP($C57&K$48,Árlista!$B:$F,3,0)","v":"9 400,-Ft "},{"$f":"VLOOKUP($C57&L$48,Árlista!$B:$F,3,0)","v":"23 370,-Ft "},{"$f":"VLOOKUP($C57&M$48,Árlista!$B:$F,3,0)","v":"31 130,-Ft "},{"$f":"VLOOKUP($C57&N$48,Árlista!$B:$F,3,0)","v":"26 410,-Ft "},null,null,null,null,null,"Szűrési tartomány szilárd szennyeződésre :",null,null,null,"15 µ","3 µ","1 µ","0,1 µ","0,01 µ"]
[null,null,12075,198,"AF 0186",{"$f":"VLOOKUP($C58&F$48,Árlista!$B:$F,3,0)","v":"14 210,-Ft "},{"$f":"VLOOKUP($C58&G$48,Árlista!$B:$F,3,0)","v":"11 840,-Ft "},{"$f":"VLOOKUP($C58&H$48,Árlista!$B:$F,3,0)","v":"11 840,-Ft "},{"$f":"VLOOKUP($C58&I$48,Árlista!$B:$F,3,0)","v":"11 840,-Ft "},{"$f":"VLOOKUP($C58&J$48,Árlista!$B:$F,3,0)","v":"11 840,-Ft "},{"$f":"VLOOKUP($C58&K$48,Árlista!$B:$F,3,0)","v":"11 840,-Ft "},{"$f":"VLOOKUP($C58&L$48,Árlista!$B:$F,3,0)","v":"28 650,-Ft "},{"$f":"VLOOKUP($C58&M$48,Árlista!$B:$F,3,0)","v":"38 310,-Ft "},{"$f":"VLOOKUP($C58&N$48,Árlista!$B:$F,3,0)","v":"33 390,-Ft "},null,null,null,null,null,"Szűrési osztály szilárd szenny. (ISO 8573-1):",1,null,null,7,6,3,2,1,1]
[null,null,22075,335,"AF 0306",{"$f":"VLOOKUP($C59&F$48,Árlista!$B:$F,3,0)","v":"20 050,-Ft "},{"$f":"VLOOKUP($C59&G$48,Árlista!$B:$F,3,0)","v":"16 700,-Ft "},{"$f":"VLOOKUP($C59&H$48,Árlista!$B:$F,3,0)","v":"16 700,-Ft "},{"$f":"VLOOKUP($C59&I$48,Árlista!$B:$F,3,0)","v":"16 700,-Ft "},{"$f":"VLOOKUP($C59&J$48,Árlista!$B:$F,3,0)","v":"16 700,-Ft "},{"$f":"VLOOKUP($C59&K$48,Árlista!$B:$F,3,0)","v":"16 700,-Ft "},{"$f":"VLOOKUP($C59&L$48,Árlista!$B:$F,3,0)","v":"32 230,-Ft "},{"$f":"VLOOKUP($C59&M$48,Árlista!$B:$F,3,0)","v":"60 730,-Ft "},{"$f":"VLOOKUP($C59&N$48,Árlista!$B:$F,3,0)","v":"37 550,-Ft "},null,null,null,null,null,"Szűrési tartomány maradék olajtartalomra :","< 0,005 mg/m³",null,null,"-","-","-","< 0,1 mg/m³","< 0,01 mg/m³","< 0,005 mg/m³"]
[null,null,32075,510,"AF 0476",{"$f":"VLOOKUP($C60&F$48,Árlista!$B:$F,3,0)","v":"24 250,-Ft "},{"$f":"VLOOKUP($C60&G$48,Árlista!$B:$F,3,0)","v":"20 200,-Ft "},{"$f":"VLOOKUP($C60&H$48,Árlista!$B:$F,3,0)","v":"20 200,-Ft "},{"$f":"VLOOKUP($C60&I$48,Árlista!$B:$F,3,0)","v":"20 200,-Ft "},{"$f":"VLOOKUP($C60&J$48,Árlista!$B:$F,3,0)","v":"20 200,-Ft "},{"$f":"VLOOKUP($C60&K$48,Árlista!$B:$F,3,0)","v":"20 200,-Ft "},{"$f":"VLOOKUP($C60&L$48,Árlista!$B:$F,3,0)","v":"35 240,-Ft "},{"$f":"VLOOKUP($C60&M$48,Árlista!$B:$F,3,0)","v":"84 110,-Ft "},{"$f":"VLOOKUP($C60&N$48,Árlista!$B:$F,3,0)","v":"41 050,-Ft "},null,null,null,null,null,"Szűrési osztály maradék olajtart. (ISO 8573-1):",1,null,null,"-","-","-",2,1,1]
[null,null,50075,780,"AF 0706",{"$f":"VLOOKUP($C61&F$48,Árlista!$B:$F,3,0)","v":"28 750,-Ft "},{"$f":"VLOOKUP($C61&G$48,Árlista!$B:$F,3,0)","v":"25 770,-Ft "},{"$f":"VLOOKUP($C61&H$48,Árlista!$B:$F,3,0)","v":"25 770,-Ft "},{"$f":"VLOOKUP($C61&I$48,Árlista!$B:$F,3,0)","v":"25 770,-Ft "},{"$f":"VLOOKUP($C61&J$48,Árlista!$B:$F,3,0)","v":"25 770,-Ft "},{"$f":"VLOOKUP($C61&K$48,Árlista!$B:$F,3,0)","v":"25 770,-Ft "},{"$f":"VLOOKUP($C61&L$48,Árlista!$B:$F,3,0)","v":"39 690,-Ft "},{"$f":"VLOOKUP($C61&M$48,Árlista!$B:$F,3,0)","v":"130 130,-Ft "},{"$f":"VLOOKUP($C61&N$48,Árlista!$B:$F,3,0)","v":"46 250,-Ft "},null,null,null,null,null,"Nyomásesés új betét esetében :","60 mbar",null,null,"20 mbar","10 mbar","20 mbar","50 mbar","80 mbar","60 mbar"]
[null,null,51090,1000,"AF 0946",{"$f":"VLOOKUP($C62&F$48,Árlista!$B:$F,3,0)","v":"41 200,-Ft "},{"$f":"VLOOKUP($C62&G$48,Árlista!$B:$F,3,0)","v":"35 800,-Ft "},{"$f":"VLOOKUP($C62&H$48,Árlista!$B:$F,3,0)","v":"35 800,-Ft "},{"$f":"VLOOKUP($C62&I$48,Árlista!$B:$F,3,0)","v":"35 800,-Ft "},{"$f":"VLOOKUP($C62&J$48,Árlista!$B:$F,3,0)","v":"35 800,-Ft "},{"$f":"VLOOKUP($C62&K$48,Árlista!$B:$F,3,0)","v":"35 800,-Ft "},"-","-","-",null,null,null,null,null,"Megengedett nyomásesés eltömődésig :","-",null,null,"500 mbar","350 mbar","350 mbar","350 mbar","350 mbar","-"]
[null,null,76090,1500,"AF 1506",{"$f":"VLOOKUP($C63&F$48,Árlista!$B:$F,3,0)","v":"50 140,-Ft "},{"$f":"VLOOKUP($C63&G$48,Árlista!$B:$F,3,0)","v":"43 590,-Ft "},{"$f":"VLOOKUP($C63&H$48,Árlista!$B:$F,3,0)","v":"43 590,-Ft "},{"$f":"VLOOKUP($C63&I$48,Árlista!$B:$F,3,0)","v":"43 590,-Ft "},{"$f":"VLOOKUP($C63&J$48,Árlista!$B:$F,3,0)","v":"43 590,-Ft "},{"$f":"VLOOKUP($C63&K$48,Árlista!$B:$F,3,0)","v":"43 590,-Ft "},"-","-","-",null,null,null,null,null,"Szűrőbetét anyaga: ","boroszilikát mikroszál és aktívszén",null,null,"szinterezett réz -tisztítható","akrilszálas cellulóz","boroszilikát mikroszál","boroszilikát mikroszál","boroszilikát mikroszál","boroszilikát mikroszál és aktívszén"]
[null,null,76090,1680,"AF 1756",{"$f":"VLOOKUP($C64&F$48,Árlista!$B:$F,3,0)","v":"50 140,-Ft "},{"$f":"VLOOKUP($C64&G$48,Árlista!$B:$F,3,0)","v":"43 590,-Ft "},{"$f":"VLOOKUP($C64&H$48,Árlista!$B:$F,3,0)","v":"43 590,-Ft "},{"$f":"VLOOKUP($C64&I$48,Árlista!$B:$F,3,0)","v":"43 590,-Ft "},{"$f":"VLOOKUP($C64&J$48,Árlista!$B:$F,3,0)","v":"43 590,-Ft "},{"$f":"VLOOKUP($C64&K$48,Árlista!$B:$F,3,0)","v":"43 590,-Ft "},"-","-","-",null,null,null,null,null,"Szűrőház típusa :","AF 0106",null,null,"AF 0106","AF 0106","AF 0106","AF 0106","AF 0106","AF 0106"]
[null,null,51140,2160,"AF 2006",{"$f":"VLOOKUP($C65&F$48,Árlista!$B:$F,3,0)","v":"60 940,-Ft "},{"$f":"VLOOKUP($C65&G$48,Árlista!$B:$F,3,0)","v":"55 390,-Ft "},{"$f":"VLOOKUP($C65&H$48,Árlista!$B:$F,3,0)","v":"55 390,-Ft "},{"$f":"VLOOKUP($C65&I$48,Árlista!$B:$F,3,0)","v":"55 390,-Ft "},{"$f":"VLOOKUP($C65&J$48,Árlista!$B:$F,3,0)","v":"55 390,-Ft "},{"$f":"VLOOKUP($C65&K$48,Árlista!$B:$F,3,0)","v":"55 390,-Ft "},"-","-","-",null,null,null,null,null,"Üzemi hőmérsékleti tartomány :"," 1,5 - 65 °C",null,null," 1,5 - 65 °C"," 1,5 - 65 °C"," 1,5 - 65 °C"," 1,5 - 65 °C"," 1,5 - 65 °C"," 1,5 - 65 °C"]
[null,null,75140,2760,"AF 2406",{"$f":"VLOOKUP($C66&F$48,Árlista!$B:$F,3,0)","v":"70 620,-Ft "},{"$f":"VLOOKUP($C66&G$48,Árlista!$B:$F,3,0)","v":"64 190,-Ft "},{"$f":"VLOOKUP($C66&H$48,Árlista!$B:$F,3,0)","v":"64 190,-Ft "},{"$f":"VLOOKUP($C66&I$48,Árlista!$B:$F,3,0)","v":"64 190,-Ft "},{"$f":"VLOOKUP($C66&J$48,Árlista!$B:$F,3,0)","v":"64 190,-Ft "},{"$f":"VLOOKUP($C66&K$48,Árlista!$B:$F,3,0)","v":"64 190,-Ft "},"-","-","-",null,null,null,null,null,"Javasolt csereintervallum:","Félévente",null,null,"Megengedett nyomásesés elérésekor, vagy évente","Megengedett nyomásesés elérésekor, vagy évente","Megengedett nyomásesés elérésekor, vagy évente","Megengedett nyomásesés elérésekor, vagy évente","Megengedett nyomásesés elérésekor, vagy évente","Félévente","Megengedett nyomásesés elérésekor, vagy évente"]
[]
[null,null,"KONDENZÁTUM \nLEERESZTŐ",null,"MCD-B","MCD","AOK16B","AOK 20B","TD 16M","CDI 16B","ECD 15B","ECD 40B","ECD 90B","ECD 150B"]
[null,null,"Nettó ár [HUF]",null,{"$f":"VLOOKUP(E68,Árlista!$B:$F,3,0)","v":"2 020,-Ft "},{"$f":"VLOOKUP(F68,Árlista!$B:$F,3,0)","v":"2 620,-Ft "},{"$f":"VLOOKUP(G68,Árlista!$B:$F,3,0)","v":"7 060,-Ft "},{"$f":"VLOOKUP(H68,Árlista!$B:$F,3,0)","v":"11 130,-Ft "},{"$f":"VLOOKUP(I68,Árlista!$B:$F,3,0)","v":"21 150,-Ft "},{"$f":"VLOOKUP(J68,Árlista!$B:$F,3,0)","v":"39 520,-Ft "},{"$f":"VLOOKUP(K68,Árlista!$B:$F,3,0)","v":"46 160,-Ft "},{"$f":"VLOOKUP(L68,Árlista!$B:$F,3,0)","v":"47 100,-Ft "},{"$f":"VLOOKUP(M68,Árlista!$B:$F,3,0)","v":"47 720,-Ft "},{"$f":"VLOOKUP(N68,Árlista!$B:$F,3,0)","v":"58 200,-Ft "}]
[]
[null,null,null,null,"EMD 12","EMD 12A","EMD 12C","EMD 25","EMD 75","EMD 12 Vac","EMD 12A Vac","EMD 12A Vdc","IED"]
[null,null,null,null,{"$f":"VLOOKUP(E71,Árlista!$B:$F,3,0)","v":"33 630,-Ft "},{"$f":"VLOOKUP(F71,Árlista!$B:$F,3,0)","v":"36 290,-Ft "},{"$f":"VLOOKUP(G71,Árlista!$B:$F,3,0)","v":"39 470,-Ft "},{"$f":"VLOOKUP(H71,Árlista!$B:$F,3,0)","v":"41 930,-Ft "},{"$f":"VLOOKUP(I71,Árlista!$B:$F,3,0)","v":"43 120,-Ft "},{"$f":"VLOOKUP(J71,Árlista!$B:$F,3,0)","v":"40 550,-Ft "},{"$f":"VLOOKUP(K71,Árlista!$B:$F,3,0)","v":"46 750,-Ft "},{"$f":"VLOOKUP(L71,Árlista!$B:$F,3,0)","v":"43 830,-Ft "},{"$f":"VLOOKUP(M71,Árlista!$B:$F,3,0)","v":"24 110,-Ft "}]
[]
[null,null,"DIFFERENTIAL \nPRESSURE INDICATORS",null,"PDI 16","MDM 60","MDM 60C","MDM 60E","MDA60","MDM 40","MDM 40C","EPG 60","EPG 60SN"]
[null,null,"Nettó ár [HUF]",null,{"$f":"VLOOKUP(E74,Árlista!$B:$F,3,0)","v":"4 540,-Ft "},{"$f":"VLOOKUP(F74,Árlista!$B:$F,3,0)","v":"10 470,-Ft "},{"$f":"VLOOKUP(G74,Árlista!$B:$F,3,0)","v":"14 630,-Ft "},{"$f":"VLOOKUP(H74,Árlista!$B:$F,3,0)","v":"18 470,-Ft "},{"$f":"VLOOKUP(I74,Árlista!$B:$F,3,0)","v":"14 270,-Ft "},{"$f":"VLOOKUP(J74,Árlista!$B:$F,3,0)","v":"10 060,-Ft "},{"$f":"VLOOKUP(K74,Árlista!$B:$F,3,0)","v":"14 050,-Ft "},{"$f":"VLOOKUP(L74,Árlista!$B:$F,3,0)","v":"38 200,-Ft "},{"$f":"VLOOKUP(M74,Árlista!$B:$F,3,0)","v":"52 330,-Ft "}]
[]
[null,null,"KIEGÉSZÍTŐK ",null,"Vent for AOK 20B","AF 0056 to AF 2406","AF 0056 to AF 0106","AF 0186 to AF 0706","AF 0056 to AF 0106","AF 0056 to AF 0106","AF 0186 to AF 0706","AF 0186 to AF 0706","AF 0056 to AF 0106"]
[null,null,null,null,"Nipple","SG","WS","WM","2S","3S","2M","3M","AK-3/8”, AK-½”, AK-3/4” "]
[null,null,"Nettó ár [HUF]",null,{"$f":"VLOOKUP(E78,Árlista!$B:$F,3,0)","v":"4 810,-Ft "},{"$f":"VLOOKUP(F78,Árlista!$B:$F,3,0)","v":"4 500,-Ft "},{"$f":"VLOOKUP(G78,Árlista!$B:$F,3,0)","v":"11 130,-Ft "},{"$f":"VLOOKUP(H78,Árlista!$B:$F,3,0)","v":"13 930,-Ft "},{"$f":"VLOOKUP(I78,Árlista!$B:$F,3,0)","v":"2 950,-Ft "},{"$f":"VLOOKUP(J78,Árlista!$B:$F,3,0)","v":"3 830,-Ft "},{"$f":"VLOOKUP(K78,Árlista!$B:$F,3,0)","v":"4 540,-Ft "},{"$f":"VLOOKUP(L78,Árlista!$B:$F,3,0)","v":"5 600,-Ft "},{"$f":"VLOOKUP(M78,Árlista!$B:$F,3,0)","v":"22 150,-Ft "}]
[]
[null,null,null,null,"AF 0186 to AF 0706",null,"AF 0946 to AF 2406"]
[null,null,null,null,"AK-1”, AK-1½”",null,"AK-2”, AK-2½”, AK-3” "]
[null,null,null,null,{"$f":"VLOOKUP(E82,Árlista!$B:$F,3,0)","v":"25 740,-Ft "},null,{"$f":"VLOOKUP(G82,Árlista!$B:$F,3,0)","v":"64 740,-Ft "}]
[]
[]
[]
[]
[]
[]
[]
[]
[]
[]
[]
[]
[]
[]
[]
[]
[]
[]
[]
[]
[]
[]
[]
[]
[]
[]
[]
[]
[]
[]
[null,null,null,"Szűrőház","Betét","Méretezés",1,2,3,4]
[null,null,null,"AF 0056",6050,"3/8’’",56,60,10,1000]
[null,null,null,"AF 0076",7050,"1/2’’",76,80,13,1300]
[null,null,null,"AF 0106",14050,"3/4’’",106,120,20,2000]
[null,null,null,"AF 0186",12075,"1’’",186,200,33,3300]
[null,null,null,"AF 0306",22075,"1’’",306,340,60,5600]
[null,null,null,"AF 0476",32075,"1 1/2’’",476,510,85,8600]
[null,null,null,"AF 0706",50075,"1 1/2’’",706,800,130,13000]
[null,null,null,"AF 0946",51090,"2’’",946,1000,170,165000]
[null,null,null,"AF 1506",76090,"2’’",1506,1500,250,250000]
[null,null,null,"AF 1756",76090,"2 1/2’’",1756,"-","-","-"]
[null,null,null,"AF 2006",51140,3,2006,"-","-","-"]
[null,null,null,"AF 2406",75140,3,2406,2400,400,"-"]
[]
[]
[null,null,null,"Gyártó","Méretezés","3 µ","1 µ","0,1 µ","0,01 µ","Aktív szén","AF 0106","A"]
[null,null,null,"OMEGA",1,"P","R","M","S","A"]
[null,null,null,"ALUP / AGRE",2,"PF","MF","DF","SF","AF",{"$f":"D131&\": \"&M131&\" \"&L131","v":"ALUP / AGRE: AF 120"},{"$f":"VLOOKUP(K$129,D$115:J$126,5,0)","v":120},{"$f":"HLOOKUP(L$129,F$130:J$138,2,0)","v":"AF"}]
[null,null,null,"ABAC / BALMA",2,"AQF","AEF","APF","AHF","ACF",{"$f":"D132&\": \"&M132&\" \"&L132","v":"ABAC / BALMA: ACF 120"},{"$f":"VLOOKUP(K$129,D$115:J$126,5,0)","v":120},{"$f":"HLOOKUP(L$129,F$130:J$138,3,0)","v":"ACF"}]
[null,null,null,"CECATTO",3,"FPRO","FMO","FPRE","FMM","FCA","CECATTO: FCA 20",{"$f":"VLOOKUP(K$129,D$115:J$126,6,0)","v":20},{"$f":"HLOOKUP(L$129,F$130:J$138,4,0)","v":"FCA"}]
[null,null,null,"CHICAGO PNEUMATIC",2,"CPFP","CPFM","CPFD","CPFS","CPFA","CHICAGO PNEUMATIC: CPFA 120",120,{"$f":"HLOOKUP(L$129,F$130:J$138,5,0)","v":"CPFA"}]
[null,null,null,"MARK",3,"FPRO","FMO","FPRE","FMM","FCA","MARK: FCA 20",{"$f":"VLOOKUP(K$129,D$115:J$126,6,0)","v":20},{"$f":"HLOOKUP(L$129,F$130:J$138,6,0)","v":"FCA"}]
[null,null,null,"WHORTINGTON",2,"DP","DM","DD","DS","DA","WHORTINGTON: DA 120",120,{"$f":"HLOOKUP(L$129,F$130:J$138,7,0)","v":"DA"}]
[null,null,null,"FIAC",4,"FQ","FP","FP","FD","FC","FIAC: FC 2000",{"$f":"VLOOKUP(K$129,D$115:J$126,7,0)","v":2000},{"$f":"HLOOKUP(L$129,F$130:J$138,8,0)","v":"FC"}]
[null,null,null,"ZONDER",3,"-","FMD","FPRE","FMM","-","ZONDER: - 20",{"$f":"VLOOKUP(K$129,D$115:J$126,6,0)","v":20},{"$f":"HLOOKUP(L$129,F$130:J$138,9,0)","v":"-"}]

{"sheet":"OMEGA WOS","index":16,"n_rows":83,"n_cols":17,"rows_kept":83,"cut":false,"hidden":false,"merged":[[40,12,42,12],[40,13,42,13],[43,2,43,3],[44,2,44,3],[45,2,45,3],[40,11,42,11],[67,4,68,8],[67,9,68,9],[29,2,31,2],[29,3,30,3],[29,4,30,6],[29,7,30,7],[29,8,31,8],[36,2,36,9],[38,2,39,4],[40,2,42,3],[40,4,42,4],[40,5,42,6],[48,2,48,3],[49,2,49,3],[46,2,46,3],[0,2,1,3],[75,12,77,12],[75,13,77,13],[81,2,81,3],[82,2,82,3],[67,10,69,10],[67,11,69,11],[73,2,74,4],[75,2,77,2],[75,3,76,3],[75,4,77,4],[75,5,77,5],[75,11,77,11],[29,9,31,9],[67,2,69,2],[67,3,68,3]]}
["TARTALOM",null,"WOS series"]
["Árlista"]
["Megrendelő"]
["ABAC dugattyús kompresszorok"]
["ABAC CleanAir fogászati kompresszor"]
["AGRE ipari dugattyús kompresszorok"]
["ALUP SONETTO csavarkomp 2,2-15kW"]
["ALUP SCK csavarkomp 4-75kW"]
["ALUP LARGO, ALLEGRO csavarkompr"]
["ALUP Hűtveszárítók"]
["ALUP szűrők"]
["ALUP SpiralAir -Scroll kompresszor"]
["ALUP dugattyús kompresszorok"]
["OMEGA vonali szűrők"]
["OMEGA ciklonszűrők"]
["OMEGA olaj-víz szétválasztók"]
["ABAC sűrítők"]
["CONDOR nyomáskapcsolók",null,null,null,null,null,null,null,null,null,null,null,null,null,null,null,"INDEX "]
["Tartályok"]
["Egyéb alaktrészek"]
[]
[]
[]
[]
[]
[]
[]
[]
[null,null,"WOS SERIES"]
[null,null,"WOS\n MODEL","Kompresszor kapacitás\n15 °C 60%RH / 25 °C 60%RH / 40 °C 100%RH","Méretek",null,null,"Tömeg","Szűrő \nbetét\ntípus","Nettó ár\n[HUF]"]
[]
[null,null,null,"[Nm³/min]","A [mm]","B [mm]","C [mm]","kg"]
[null,null,"WOS 4","4,82 / 4,04 / 2,05",416,243,411,2.77,"PP,AK, WOS4",{"$f":"VLOOKUP(C33,Árlista!$B:$F,3,0)","v":"88 530,-Ft "}]
[null,null,"WOS 8","10,0 / 8,4 / 4,25",730,343,680,11.77,"PP,AK, WOS8",{"$f":"VLOOKUP(C34,Árlista!$B:$F,3,0)","v":"135 840,-Ft "}]
[null,null,"WOS 20","24,4 / 20,5 / 10,37",820,366,940,16.23,"PP,AK, WOS20",{"$f":"VLOOKUP(C35,Árlista!$B:$F,3,0)","v":"191 610,-Ft "}]
[null,null,"WOS 35","42,3 / 35,5 / 17,99",960,386,1137,21.54,"PP,AK, WOS35",{"$f":"VLOOKUP(C36,Árlista!$B:$F,3,0)","v":"260 250,-Ft "}]
[null,null,"Hűvös / Enyhe / Forró klímatikus viszony esetén.\nMEGJEGYZÉS\n- Ár csak a szűrőházra vonatkozik"]
[]
[null,null,"SZŰRŐ \nBETÉT"]
[null,null,null,null,null,"PP","AK"]
[null,null,"Szűrő \nbetét \ntípus",null,"Corresponding\nház","Nettó \nÁr\n[HUF]"]
[]
[]
[null,null,"WOS 4",null,"WOS-4",{"$f":"VLOOKUP(C44&F$40,Árlista!$B:$F,3,0)","v":"15 210,-Ft "},{"$f":"VLOOKUP(C44&G$40,Árlista!$B:$F,3,0)","v":"15 210,-Ft "}]
[null,null,"WOS 8",null,"WOS-8",{"$f":"VLOOKUP(C45&F$40,Árlista!$B:$F,3,0)","v":"21 300,-Ft "},{"$f":"VLOOKUP(C45&G$40,Árlista!$B:$F,3,0)","v":"21 300,-Ft "}]
[null,null,"WOS 20",null,"WOS-20",{"$f":"VLOOKUP(C46&F$40,Árlista!$B:$F,3,0)","v":"30 990,-Ft "},{"$f":"VLOOKUP(C46&G$40,Árlista!$B:$F,3,0)","v":"30 990,-Ft "}]
[null,null,"WOS 35",null,"WOS-35",{"$f":"VLOOKUP(C47&F$40,Árlista!$B:$F,3,0)","v":"50 170,-Ft "},{"$f":"VLOOKUP(C47&G$40,Árlista!$B:$F,3,0)","v":"50 170,-Ft "}]
[]
[null,null,"WATER QUALITY\nTEST KIT",null,"WQTK"]
[null,null,"Nettó ár [HUF]",null,{"$f":"VLOOKUP(E49,Árlista!$B:$F,3,0)","v":"12 170,-Ft "}]
[]
[]
[null,null,"WOSm series"]
[]
[]
[null,null,null,null,null,null,null,null,null,null,null,null,null,null,null,null,"INDEX "]
[]
[]
[]
[]
[]
[]
[]
[]
[]
[]
[null,null,"WOSm SERIES"]
[null,null,"WOSm MODEL","Átáramlási képesség\n15 °C 60%RH / 25 °C 60%RH / 40 °C 100%RH","Méretek",null,null,null,null,"Tömeg","Szűrő \nbetét\ntípus","Nettó ár\n[HUF]"]
[]
[null,null,null,"[Nm³/h]","A [mm]","B [mm]","C [mm]","D [mm]","E [mm]","kg"]
[null,null,"WOSm 1","1,23 / 1,08 / 0,62",483,106,80,335,50,1.21,"0305",{"$f":"VLOOKUP(C71,Árlista!$B:$F,3,0)","v":"38 220,-Ft "}]
[null,null,"WOSm 2","2,54 / 2,23 / 1,28",816,106,80,670,50,1.75,"0310",{"$f":"VLOOKUP(C72,Árlista!$B:$F,3,0)","v":"45 980,-Ft "}]
[]
[null,null,"SZŰRŐ \nBETÉT"]
[null,null,null,null,null,"WOSm"]
[null,null,"Szűrő \nbetét \ntípus","Átáramlási képesség\n15 °C 60%RH / 25 °C 60%RH / 40 °C 100%RH","Corresponding\nház","Nettó \nÁr\n[HUF]"]
[]
[null,null,null,"[Nm³/h]"]
[null,null,"WOS-m1","1,23 / 1,08 / 0,62","CKL-CHP 003",{"$f":"VLOOKUP(C79,Árlista!$B:$F,3,0)","v":"21 050,-Ft "}]
[null,null,"WOS-m2","2,54 / 2,23 / 1,28","CKL-CHP 005",{"$f":"VLOOKUP(C80,Árlista!$B:$F,3,0)","v":"28 180,-Ft "}]
[]
[null,null,"WATER QUALITY\nTEST KIT",null,"WQTK"]
[null,null,"Nettó ár [HUF]",null,{"$f":"VLOOKUP(E82,Árlista!$B:$F,3,0)","v":"12 170,-Ft "}]

{"sheet":"AGRE ip dugattyús","index":17,"n_rows":31,"n_cols":11,"rows_kept":31,"cut":false,"hidden":false,"merged":[[12,2,12,10],[18,2,18,10],[22,2,22,10],[26,2,26,10],[10,2,11,2],[10,3,11,3],[10,4,11,4],[10,5,11,5],[10,10,11,10],[10,6,11,6],[10,7,11,7],[10,8,11,8],[10,9,11,9]]}
["TARTALOM"]
["Árlista"]
["Megrendelő"]
["ABAC dugattyús kompresszorok"]
["ABAC CleanAir fogászati kompresszor"]
["AGRE ipari dugattyús kompresszorok"]
["ALUP SONETTO csavarkomp 2,2-15kW"]
["ALUP SCK csavarkomp 4-75kW"]
["ALUP LARGO, ALLEGRO csavarkompr"]
["ALUP Hűtveszárítók",null,null,"AKK",null,"AEK",null,null,"AGK"]
["ALUP szűrők",null,"Alup cikkszám","Megnevezés","Teljesítm (HP)","Max nyomás Bar","Elektr csatlak","Indítás","Tulajdonság","Tartály (l)","Nettó ár (HUF)"]
["ALUP SpiralAir -Scroll kompresszor"]
["ALUP dugattyús kompresszorok",null,"Direkthajtásos sűrítő egység motorral - egy fokozatú 10 bar"]
["OMEGA vonali szűrők",null,4153126616,"AKK 301-W",2,10,"230/1/50","DOL","Agregát",null,{"$f":"VLOOKUP(C14,Árlista!B:I,3,0)","v":"1 139,-€ "}]
["OMEGA ciklonszűrők",null,4153126607,"AKK 301-D",2,10,"400/3/50","DOL","Agregát",null,{"$f":"VLOOKUP(C15,Árlista!B:I,3,0)","v":"1 035,-€ "}]
["OMEGA olaj-víz szétválasztók",null,4153126614,"AEK 461-W",3,10,"230/1/50","DOL","Agregát",null,{"$f":"VLOOKUP(C16,Árlista!B:I,3,0)","v":"1 365,-€ "}]
["ABAC sűrítők",null,4153126617,"AEK 461-D",3,10,"400/3/50","DOL","Agregát",null,{"$f":"VLOOKUP(C17,Árlista!B:I,3,0)","v":"1 252,-€ "}]
["CONDOR nyomáskapcsolók",null,4153126618,"AEK 601",4,10,"400/3/50","DOL","Agregát",null,{"$f":"VLOOKUP(C18,Árlista!B:I,3,0)","v":"1 412,-€ "}]
["Tartályok",null,"Direkthajtásos sűrítő egység motorral - két fokozatú 10 bar"]
["Egyéb alaktrészek",null,4153126402,"AGK-N-271",2,10,"400/3/50","DOL","Agregát",null,{"$f":"VLOOKUP(C20,Árlista!B:I,3,0)","v":"1 308,-€ "}]
[null,null,4153126611,"AGK-N-551",4,10,"400/3/50","DOL","Agregát",null,{"$f":"VLOOKUP(C21,Árlista!B:I,3,0)","v":"1 732,-€ "}]
[null,null,4153126604,"AEK 851",5.5,10,"400/3/50","DOL","Agregát",null,{"$f":"VLOOKUP(C22,Árlista!B:I,3,0)","v":"1 939,-€ "}]
[null,null,"Direkthajtásos sűrítő egység motorral - két fokozatú 15 bar"]
[null,null,4153126401,"AGK-H-271",2,15,"400/3/50","DOL","Agregát",null,{"$f":"VLOOKUP(C24,Árlista!B:I,3,0)","v":"1 346,-€ "}]
[null,null,4153126610,"AGK-H-551",4,15,"400/3/50","DOL","Agregát",null,{"$f":"VLOOKUP(C25,Árlista!B:I,3,0)","v":"1 638,-€ "}]
[null,null,4153126608,"AGK-H-751",5.5,15,"400/3/50","DOL","Agregát",null,{"$f":"VLOOKUP(C26,Árlista!B:I,3,0)","v":"1 995,-€ "}]
[null,null,"Direkthajtásos sűrítő egység motorral - 10 bar -olajmentes kivitel"]
[null,null,4153126612,"AKK-O-236-D",1.5,7,"400/3/50","DOL","Agregát",null,{"$f":"VLOOKUP(C28,Árlista!B:I,3,0)","v":"1 525,-€ "}]
[null,null,4153126400,"AGK-O-271",2,10,"400/3/50","DOL","Agregát",null,{"$f":"VLOOKUP(C29,Árlista!B:I,3,0)","v":"2 024,-€ "}]
[null,null,4153126613,"AGK-O-551",4,10,"400/3/50","DOL","Agregát",null,{"$f":"VLOOKUP(C30,Árlista!B:I,3,0)","v":"2 551,-€ "}]
[null,null,4153126606,"AGK-O-751",5.5,10,"400/3/50","DOL","Agregát",null,{"$f":"VLOOKUP(C31,Árlista!B:I,3,0)","v":"2 880,-€ "}]

{"sheet":"ABAC sűrítők és alkatr","index":18,"n_rows":210,"n_cols":54,"rows_kept":210,"cut":false,"hidden":false,"merged":[[30,43,30,46],[30,47,30,50],[30,51,30,54],[50,43,50,46],[50,47,50,50],[50,51,50,54],[50,28,50,31],[50,32,50,35],[50,24,50,27],[51,29,56,31],[51,25,56,27],[27,24,27,27],[28,29,33,31],[28,33,33,35],[28,25,33,27],[35,24,35,27],[27,28,27,31],[27,32,27,35],[195,5,196,8],[195,10,196,12],[195,14,196,17],[194,4,194,8],[194,10,194,12],[194,13,194,17],[150,4,150,8],[150,10,150,12],[150,13,150,17],[151,5,152,8],[151,10,152,12],[151,14,152,17],[53,13,53,17],[54,10,55,12],[54,13,55,17],[102,4,102,8],[53,4,53,8],[54,5,55,8],[53,10,53,12],[103,5,104,8],[102,13,102,17],[103,14,104,17],[102,10,102,12],[103,10,104,12]]}
["TARTALOM",null,null,null,null,null,null,null,null,null,null,null,null,null,null,null,null,null,null,null,"LÉGSZERSZÁMOK",null,null,null,null,null,null,null,null,null,null,null,null,null,null,null,null,null,null,"LÉGSZERSZÁMOK"]
["Árlista",null,null,null,null,null,null,null,null,null,null,null,null,null,null,null,null,null,null,null,"Árlista",null,null,null,null,null,null,null,null,null,null,null,null,null,null,null,null,null,null,"Árlista"]
["Megrendelő",null,null,null,null,null,null,null,null,null,null,null,null,null,null,null,null,null,null,null,"Megrendelő",null,null,null,null,null,null,null,null,null,null,null,null,null,null,null,null,null,null,"Megrendelő"]
["ABAC dugattyús kompresszorok",null,null,null,null,null,null,null,null,null,null,null,null,null,null,null,null,null,null,null,"Fúrók",null,null,null,null,null,null,null,null,null,null,null,null,null,null,null,null,null,null,"Fúrók"]
["ABAC CleanAir fogászati kompresszor",null,null,null,null,null,null,null,null,null,null,null,null,null,null,null,null,null,null,null,"Racsnis kulcsok",null,null,null,null,null,null,null,null,null,null,null,null,null,null,null,null,null,null,"Racsnis kulcsok"]
["AGRE ipari dugattyús kompresszorok",null,null,null,null,null,null,null,null,null,null,null,null,null,null,null,null,null,null,null,"Csavarbehajtók",null,null,null,null,null,null,null,null,null,null,null,null,null,null,null,null,null,null,"Csavarbehajtók"]
["ALUP SONETTO csavarkomp 2,2-15kW",null,null,null,null,null,null,null,null,null,null,null,null,null,null,null,null,null,null,null,"Sarokcsiszolók",null,null,null,null,null,null,null,null,null,null,null,null,null,null,null,null,null,null,"Sarokcsiszolók"]
["ALUP SCK csavarkomp 4-75kW",null,null,null,null,null,null,null,null,null,null,null,null,null,null,null,null,null,null,null,"Légkulcsok",null,null,null,null,null,null,null,null,null,null,null,null,null,null,null,null,null,null,"Légkulcsok"]
["ALUP LARGO, ALLEGRO csavarkompr",null,null,null,null,null,null,null,null,null,null,null,null,null,null,null,null,null,null,null,"Egyenes csiszolók",null,null,null,null,null,null,null,null,null,null,null,null,null,null,null,null,null,null,"Egyenes csiszolók"]
["ALUP Hűtveszárítók",null,null,null,null,null,null,null,null,null,null,null,null,null,null,null,null,null,null,null,"Szalag és excenter csiszolók",null,null,null,null,null,null,null,null,null,null,null,null,null,null,null,null,null,null,"Szalag és excenter csiszolók"]
["ALUP szűrők",null,null,null,null,null,null,null,null,null,null,null,null,null,null,null,null,null,null,null,"Polír- és fiber csiszolók",null,null,null,null,null,null,null,null,null,null,null,null,null,null,null,null,null,null,"Polír- és fiber csiszolók"]
["ALUP SpiralAir -Scroll kompresszor",null,null,null,null,null,null,null,null,null,null,null,null,null,null,null,null,null,null,null,"Vésők, leverők …",null,null,null,null,null,null,null,null,null,null,null,null,null,null,null,null,null,null,"Vésők, leverők …"]
["ALUP dugattyús kompresszorok",null,null,null,null,null,null,null,null,null,null,null,null,null,null,null,null,null,null,null,"Szóró- és lefúvató pisztolyok",null,null,null,null,null,null,null,null,null,null,null,null,null,null,null,null,null,null,"Szóró- és lefúvató pisztolyok"]
["OMEGA vonali szűrők",null,null,null,null,null,null,null,null,null,null,null,null,null,null,null,null,null,null,null,"Vágók, fűrészek, szegecshúzók",null,null,null,null,null,null,null,null,null,null,null,null,null,null,null,null,null,null,"Vágók, fűrészek, szegecshúzók"]
["OMEGA ciklonszűrők",null,null,null,null,null,null,null,null,null,null,null,null,null,null,null,null,null,null,null,"Dugókulcsok",null,null,null,null,null,null,null,null,null,null,null,null,null,null,null,null,null,null,"Dugókulcsok"]
["OMEGA olaj-víz szétválasztók",null,null,null,null,null,null,null,null,null,null,null,null,null,null,null,null,null,null,null,"Csatlakozók, tömlők, kellékek",null,null,null,null,null,null,null,null,null,null,null,null,null,null,null,null,null,null,"Csatlakozók, tömlők, kellékek"]
["ABAC sűrítők",null,null,null,null,null,null,null,null,null,null,null,null,null,null,null,null,null,null,null,"Abroncstöltők",null,null,null,null,null,null,null,null,null,null,null,null,null,null,null,null,null,null,"Abroncstöltők"]
["CONDOR nyomáskapcsolók",null,null,null,null,null,null,null,null,null,null,null,null,null,null,null,null,null,null,null,"Tűzők, szegbelövők",null,null,null,null,null,null,null,null,null,null,null,null,null,null,null,null,null,null,"Tűzők, szegbelövők"]
["Tartályok",null,null,null,null,null,null,null,null,null,null,null,null,null,null,null,null,null,null,null,"Garázsipari eszközök",null,null,null,null,null,null,null,null,null,null,null,null,null,null,null,null,null,null,"Garázsipari eszközök"]
["Egyéb alaktrészek",null,null,null,null,null,null,null,null,null,null,null,null,null,null,null,null,null,null,null,"AKKUMULÁTOROS GÉPEK",null,null,"Sűrítők és alkatészei",null,null,null,null,null,null,null,null,null,null,null,null,null,null,null,"AKKUMULÁTOROS GÉPEK",null,null,"Sűrítők és alkatészei"]
[null,null,null,null,null,null,null,null,null,null,null,null,null,null,null,null,null,null,null,null,"KOMPRESSZOROK ABAC - ALUP",null,null,"Nyomáskapcsolók",null,null,null,null,null,null,null,null,null,null,null,null,null,null,null,"KOMPRESSZOROK ABAC - ALUP",null,null,"Nyomáskapcsolók"]
[null,null,null,null,null,null,null,null,null,null,null,null,null,null,null,null,null,null,null,null,"KOMPRESSZOR ALKATRÉSZEK",null,null,"Egyéb alkatrészek",null,null,null,null,null,null,null,null,null,null,null,null,null,null,null,"KOMPRESSZOR ALKATRÉSZEK",null,null,"Egyéb alkatrészek"]
[]
[]
[]
[]
[null,null,null,null,null,null,null,null,null,null,null,null,null,null,null,null,null,null,null,null,null,null,null,null,"MDR 1",null,"MDR 2",null,null,null,"MDR 3",null,null,null,"MDR 5"]
[null,null,null,null,null,null,null,null,null,null,null,null,null,null,null,null,null,null,null,null,{"$f":"#REF!","v":{"$error":"#REF!"}},null,null,"Chicago Pneumatic","MDR 2-11 Nyomáskapcsoló",null,null,null,"MDR 3-11 Nyomáskapcsoló",null,null,null,"MDR 5-11 Nyomáskapcsoló",null,null,null,null,null,null,{"$f":"#REF!","v":{"$error":"#REF!"}}]
[null,null,null,null,null,null,null,null,null,null,null,null,null,null,null,null,null,null,null,null,{"$f":"#REF!","v":{"$error":"#REF!"}},null,null,"Pólusok száma","2","Condor nyomáskapcsoló 1 fázisú motorokhoz. Megbizható, hosszú élettartam. Nyomáskülönbség állítással, tehermentesítővel",null,null,"3","Condor nyomáskapcsoló 3 fázisú motorokhoz. Megbizható, hosszú élettartam. Nyomáskülönbség állítással, motorvédelemmel és tehermentesítővel szerelve.",null,null,"3","Condor nyomáskapcsoló 3 fázisú motorokhoz. Megbizható, hosszú élettartam. Nyomáskülönbség állítással, motorvédelemmel és tehermentesítővel szerelve.",null,null,null,null,null,{"$f":"#REF!","v":{"$error":"#REF!"}}]
[null,null,null,null,null,null,null,null,null,null,null,null,null,null,null,null,null,null,null,null,{"$f":"#REF!","v":{"$error":"#REF!"}},null,null,"Feszültség","230",null,null,null,"400",null,null,null,"400",null,null,null,null,null,null,{"$f":"#REF!","v":{"$error":"#REF!"}}]
[null,null,null,null,null,null,null,null,null,null,null,null,null,null,null,null,null,null,null,null,{"$f":"#REF!","v":{"$error":"#REF!"}},null,null,"Max. motorteljesítmény","2,2",null,null,null,"7,5",null,null,null,"7,5",null,null,null,null,null,null,{"$f":"#REF!","v":{"$error":"#REF!"}},null,null,"Rodcraft","Dugattyús kompresszorolaj",null,null,null,"Visszacsapó szelep",null,null,null,"Biztonsági szelep"]
[null,null,null,null,null,null,null,null,null,null,null,null,null,null,null,null,null,null,null,null,{"$f":"#REF!","v":{"$error":"#REF!"}},null,null,"Csatlakozások","4 x 1/4\"",null,null,null,"4 x 1/4\"",null,null,null,"4 x 1/4\"",null,null,null,null,null,null,{"$f":"#REF!","v":{"$error":"#REF!"}},null,null,"Cikkszám / Típus / (Listaár) Nettó ár","+","1/2\"-1/2\"",{"$f":"VLOOKUP(AR32,Árlista!$B:$D,3,0)","v":{"$error":"#N/A"}},null,6210718900,"1/2\"-1/2\"",{"$f":"VLOOKUP(AV32,Árlista!$B:$D,3,0)","v":"3 040,-Ft "},null,6210719500,"1/4\", 8 bar",{"$f":"VLOOKUP(AZ32,Árlista!$B:$D,3,0)","v":"2 530,-Ft "}]
[null,null,null,null,null,null,null,null,null,null,null,null,null,null,null,null,null,null,null,null,{"$f":"#REF!","v":{"$error":"#REF!"}},null,null,"Nyomástartomány","3-12",null,null,null,"3-11",null,null,null,"3-11",null,null,null,null,null,null,{"$f":"#REF!","v":{"$error":"#REF!"}},null,null,"Cikkszám / Típus / (Listaár) Nettó ár","AL6215715600","2l",{"$f":"VLOOKUP(AR33,Árlista!$B:$D,3,0)","v":{"$error":"#N/A"}},null,6210719200,"3/4\"-3/4\"",{"$f":"VLOOKUP(AV33,Árlista!$B:$D,3,0)","v":{"$error":"#N/A"}},null,6210719900,"3/8\", 11 bar",{"$f":"VLOOKUP(AZ33,Árlista!$B:$D,3,0)","v":"4 000,-Ft "}]
[null,null,null,null,null,null,null,null,null,null,null,null,null,null,null,null,null,null,null,null,{"$f":"#REF!","v":{"$error":"#REF!"}},null,null,"Nomáskülönbség","2",null,null,null,"2",null,null,null,"2",null,null,null,null,null,null,{"$f":"#REF!","v":{"$error":"#REF!"}},null,null,"Cikkszám / Típus / (Listaár) Nettó ár","AL6215715700","5l","NA",null,6210718500,"1\"-3/4\"",{"$f":"VLOOKUP(AV34,Árlista!$B:$D,3,0)","v":"8 950,-Ft "},null,2236100087,"3/4\", 11 bar",{"$f":"VLOOKUP(AZ34,Árlista!$B:$D,3,0)","v":"10 310,-Ft "}]
[null,null,null,null,null,null,null,null,null,null,null,null,null,null,null,null,null,null,null,null,{"$f":"#REF!","v":{"$error":"#REF!"}},null,null,"Cikkszám / Típus / (Listaár) Nettó ár","CO-212140","MDR 1/11",{"$f":"VLOOKUP(Y35,Árlista!$B:$D,3,0)","v":"6 500,-Ft "},null,"CO-218937","4-6,3A",{"$f":"VLOOKUP(AC35,Árlista!$B:$D,3,0)","v":"17 990,-Ft "},null,"CO-218630","2,4-4,2A",{"$f":"VLOOKUP(AG35,Árlista!$B:$D,3,0)","v":"18 750,-Ft "},null,null,null,null,{"$f":"#REF!","v":{"$error":"#REF!"}},null,null,"Cikkszám / Típus / (Listaár) Nettó ár",null,null,null,null,6210718300,"1\"-1\" ",{"$f":"VLOOKUP(AV35,Árlista!$B:$D,3,0)","v":"14 700,-Ft "}]
[null,null,null,null,null,null,null,null,null,null,null,null,null,null,null,null,null,null,null,null,{"$f":"#REF!","v":{"$error":"#REF!"}},null,null,"Cikkszám / Típus / (Listaár) Nettó ár",null,null,null,null,"CO-218944","6,3-10A",{"$f":"VLOOKUP(AC36,Árlista!$B:$D,3,0)","v":"17 990,-Ft "},null,"CO-218593","4-7,0A",{"$f":"VLOOKUP(AG36,Árlista!$B:$D,3,0)","v":"18 750,-Ft "},null,null,null,null,{"$f":"#REF!","v":{"$error":"#REF!"}}]
[null,null,null,null,null,null,null,null,null,null,null,null,null,null,null,null,null,null,null,null,null,null,null,"Cikkszám / Típus / (Listaár) Nettó ár","CO-218500","MDR 2/11",{"$f":"VLOOKUP(Y37,Árlista!$B:$D,3,0)","v":"8 880,-Ft "},null,"CO-218951","10-16A",{"$f":"VLOOKUP(AC37,Árlista!$B:$D,3,0)","v":"17 990,-Ft "},null,"CO-218586","6,1-10,3A",{"$f":"VLOOKUP(AG37,Árlista!$B:$D,3,0)","v":"18 750,-Ft "}]
[null,null,null,null,null,null,null,null,null,null,null,null,null,null,null,null,null,null,null,null,null,null,null,"Cikkszám / Típus / (Listaár) Nettó ár",null,null,null,null,"CO-240686","16-20A",{"$f":"VLOOKUP(AC38,Árlista!$B:$D,3,0)","v":"17 990,-Ft "},null,"CO-218623","9-14A",{"$f":"VLOOKUP(AG38,Árlista!$B:$D,3,0)","v":"18 750,-Ft "},null,null,null,null,{"$f":"#REF!","v":{"$error":"#REF!"}}]
[null,null,null,null,null,null,null,null,null,null,null,null,null,null,null,null,null,null,null,null,null,null,null,"Cikkszám / Típus / (Listaár) Nettó ár",null,null,null,null,null,null,null,null,"CO-251057","11-18A",{"$f":"VLOOKUP(AG39,Árlista!$B:$D,3,0)","v":"18 960,-Ft "},null,null,null,null,{"$f":"#REF!","v":{"$error":"#REF!"}}]
[null,null,null,null,null,null,null,null,null,null,null,null,null,null,null,null,null,null,null,null,null,null,null,null,null,null,null,null,null,null,null,null,null,null,null,null,null,null,null,{"$f":"#REF!","v":{"$error":"#REF!"}}]
[null,null,null,null,null,null,null,null,null,null,null,null,null,null,null,null,null,null,null,null,"Jellemző motorméretek: ","230V",null,"  400V",null,null,null,null,null,null,null,null,null,null,null,null,null,null,null,{"$f":"#REF!","v":{"$error":"#REF!"}}]
[null,null,null,null,null,null,null,null,null,null,null,null,null,null,null,null,null,null,null,null,"1,5 kW  ","10,0A",null,"  3,4A",null,null,null,null,null,null,null,null,null,null,null,null,null,null,null,{"$f":"#REF!","v":{"$error":"#REF!"}}]
[null,null,null,null,null,null,null,null,null,null,null,null,null,null,null,null,null,null,null,null,"2,2 kW  ","14,5A",null,"  5,2A"]
[null,null,null,null,null,null,null,null,null,null,null,null,null,null,null,null,null,null,null,null,"3,0 kW  ","-",null,"  7,2A"]
[null,null,null,null,null,null,null,null,null,null,null,null,null,null,null,null,null,null,null,null,"4,0 kW  ","-",null,"  9,6A"]
[null,null,null,null,null,null,null,null,null,null,null,null,null,null,null,null,null,null,null,null,"5,5 kW  ","-",null," 13,0A"]
[null,null,null,null,null,null,null,null,null,null,null,null,null,null,null,null,null,null,null,null,"7,5 kW  ","-",null," 16,1A"]
[]
[]
[null,null,null,null,null,null,null,null,null,null,null,null,null,null,null,null,null,null,null,null,null,null,null,null,null,null,null,null,null,"MDR 43","MDR 53"]
[null,null,null,null,null,null,null,null,null,null,null,null,null,null,null,null,null,null,null,null,null,null,null,"Chicago Pneumatic","MDR Tehermentesítő nyomáskapcsolókhoz",null,null,null,"MDR Vezérlő nyomáskapcsolók",null,null,null,"MDR Motorvédő relé",null,null,null,null,null,null,null,null,null,"Rodcraft","Szűrő szabályozó",null,null,null,"Levegőszűrő",null,null,null,"Levegőszűrő"]
[null,null,null,null,null,null,null,null,null,null,null,null,null,null,null,null,null,null,null,null,null,null,null,"Pólusok száma","2","Condor nyomáskapcsoló 1 fázisú motorokhoz. Megbizható, hosszú élettartam. Nyomáskülönbség állítással, tehermentesítővel",null,null,"2","Condor nyomáskapcsoló 1 fázisú motorokhoz. Megbizható, hosszú élettartam. Nyomáskülönbség állítással, tehermentesítővel",null,null,"CO-201441","R3/6,3A",{"$f":"VLOOKUP(AG52,Árlista!$B:$D,3,0)","v":"8 450,-Ft "},null,null,null,null,null,null,null,"Cikkszám / Típus / (Listaár) Nettó ár",6214344100,"Micro 1/4",{"$f":"VLOOKUP(AR52,Árlista!$B:$D,3,0)","v":"9 380,-Ft "},null,6211453700,"GV34",{"$f":"VLOOKUP(AV52,Árlista!$B:$D,3,0)","v":"1 530,-Ft "},null,6211471600,"B5900",{"$f":"VLOOKUP(AZ52,Árlista!$B:$D,3,0)","v":{"$error":"#N/A"}}]
[null,null,null,null,null,null,null,null,null,null,null,null,null,null,null,null,null,null,null,null,null,null,null,"Feszültség","230",null,null,null,"230",null,null,null,"CO-201458","R3/10A",{"$f":"VLOOKUP(AG53,Árlista!$B:$D,3,0)","v":"8 450,-Ft "},null,null,null,null,null,null,null,"Cikkszám / Típus / (Listaár) Nettó ár",6214344200,"Mignon 3/8",{"$f":"VLOOKUP(AR53,Árlista!$B:$D,3,0)","v":"9 940,-Ft "},null,2236102112,"B28/38/B49",{"$f":"VLOOKUP(AV53,Árlista!$B:$D,3,0)","v":{"$error":"#N/A"}},null,2236110427,"B6000",{"$f":"VLOOKUP(AZ53,Árlista!$B:$D,3,0)","v":"15 060,-Ft "}]
[null,null,null,null,"B2800",null,null,null,null,null,null,null,null,"A29B",null,null,null,null,null,null,null,null,null,"Max. motorteljesítmény","2,2",null,null,null,"2,2",null,null,null,"CO-201465","R3/16A",{"$f":"VLOOKUP(AG54,Árlista!$B:$D,3,0)","v":"8 450,-Ft "},null,null,null,null,null,null,null,"Cikkszám / Típus / (Listaár) Nettó ár",6214345100,"PU4 1/2",{"$f":"VLOOKUP(AR54,Árlista!$B:$D,3,0)","v":"15 360,-Ft "},null,2236111635,"A29/A39",{"$f":"VLOOKUP(AV54,Árlista!$B:$D,3,0)","v":"2 270,-Ft "},null,2236110428,"B7000",{"$f":"VLOOKUP(AZ54,Árlista!$B:$D,3,0)","v":"17 480,-Ft "}]
[null,null,null,"Motorteljesítmény méret  [kW]","1,5 / 2,2","2 hengeres 1 fokozatú sűrítőfokozat, 220V és 400V-os villanymotorokhoz\n",null,null,null,null,"Típus",null,null,"Hegesztett horganyzott acél csőszerkezet, különösen stabi.",null,null,null,null,null,null,null,null,null,"Csatlakozások","4 x 1/4\"",null,null,null,"4 x 1/4\"",null,null,null,"CO-202042","R5/4,2A",{"$f":"VLOOKUP(AG55,Árlista!$B:$D,3,0)","v":"7 480,-Ft "},null,null,null,null,null,null,null,"Cikkszám / Típus / (Listaár) Nettó ár",null,null,null,null,8973035878,"L20/L30",{"$f":"VLOOKUP(AV55,Árlista!$B:$D,3,0)","v":{"$error":"#N/A"}},null,8973015500,"Betét B6-7",{"$f":"VLOOKUP(AZ55,Árlista!$B:$D,3,0)","v":"5 660,-Ft "}]
[null,null,null,"Sűrítő fordulat [rpm]","1100 - 1400",null,null,null,null,null,null,null,null,null,null,null,null,null,null,null,null,null,null,"Nyomástartomány","3-12",null,null,null,"3-12",null,null,null,"CO-202059","R5/7A",{"$f":"VLOOKUP(AG56,Árlista!$B:$D,3,0)","v":"7 480,-Ft "}]
[null,null,null,"Cikkszám / Típus / Nettó ár (Listaár)",6218739200,"B2800B","Sűrítő",{"$f":"VLOOKUP(E57,Árlista!$B:$D,3,0)","v":"47 500,-Ft "},null,null,"Cikkszám / Típus / Nettó ár (Listaár)",null,null,4116090308,"A29B","Sűrítő",{"$f":"VLOOKUP(N57,Árlista!$B:$D,3,0)","v":"57 500,-Ft "},null,null,null,null,null,null,"Nomáskülönbség","2",null,null,null,"2",null,null,null,"CO-202066","R5/10,3A",{"$f":"VLOOKUP(AG57,Árlista!$B:$D,3,0)","v":"8 130,-Ft "}]
[null,null,null,null,6229024000,315,"Hengerfej + töm",{"$f":"VLOOKUP(E58,Árlista!$B:$D,3,0)","v":"15 560,-Ft "},null,null,null,null,null,2236111635,305,"Levegőszűrő",{"$f":"VLOOKUP(N58,Árlista!$B:$D,3,0)","v":"2 270,-Ft "},null,null,null,null,null,null,"Cikkszám / Típus / (Listaár) Nettó ár","CO-200680","EV 2S",{"$f":"VLOOKUP(Y58,Árlista!$B:$D,3,0)","v":"2 270,-Ft "},null,"CO-213086","MDR53",{"$f":"VLOOKUP(AC58,Árlista!$B:$D,3,0)","v":"20 270,-Ft "},null,"CO-202073","R5/14A",{"$f":"VLOOKUP(AG58,Árlista!$B:$D,3,0)","v":"8 130,-Ft "}]
[null,null,null,null,6229020400,"340","Utóhűtő",{"$f":"VLOOKUP(E59,Árlista!$B:$D,3,0)","v":"15 070,-Ft "},null,null,null,null,null,2901325044,310,"Hengerfej + töm",{"$f":"VLOOKUP(N59,Árlista!$B:$D,3,0)","v":"23 730,-Ft "},null,null,null,null,null,null,"Cikkszám / Típus / (Listaár) Nettó ár","CO-201069","EV 3S",{"$f":"VLOOKUP(Y59,Árlista!$B:$D,3,0)","v":"2 270,-Ft "},null,"CO-212812","MDR43",{"$f":"VLOOKUP(AC59,Árlista!$B:$D,3,0)","v":"15 500,-Ft "},null,"CO-202080","R5/18A",{"$f":"VLOOKUP(AG59,Árlista!$B:$D,3,0)","v":"8 560,-Ft "}]
[null,null,null,null,8973037620,"PK1","Szeleplap KIT",{"$f":"VLOOKUP(E60,Árlista!$B:$D,3,0)","v":"18 690,-Ft "},null,null,null,null,null,2236112518,325,"Szeleplap + töm",{"$f":"VLOOKUP(N60,Árlista!$B:$D,3,0)","v":"8 550,-Ft "},null,null,null,null,null,null,"Cikkszám / Típus / (Listaár) Nettó ár","CO-201878","EV 5",{"$f":"VLOOKUP(Y60,Árlista!$B:$D,3,0)","v":"3 360,-Ft "}]
[null,null,null,null,2901324933,330,"Felújító KIT",{"$f":"VLOOKUP(E61,Árlista!$B:$D,3,0)","v":"27 000,-Ft "},null,null,null,null,null,2901325046,330,"Felújító KIT",{"$f":"VLOOKUP(N61,Árlista!$B:$D,3,0)","v":"20 580,-Ft "}]
[null,null,null,null,6229023600,335,"Tömítés készlet",{"$f":"VLOOKUP(E62,Árlista!$B:$D,3,0)","v":"5 710,-Ft "},null,null,null,null,null,2901325045,335,"Tömítés készlet",{"$f":"VLOOKUP(N62,Árlista!$B:$D,3,0)","v":"10 070,-Ft "}]
[null,null,null,null,6229020900,350,"Ventilátor tárcsa",{"$f":"VLOOKUP(E63,Árlista!$B:$D,3,0)","v":"22 670,-Ft "},null,null,null,null,null,2901325047,340,"Utóhűtő",{"$f":"VLOOKUP(N63,Árlista!$B:$D,3,0)","v":"19 990,-Ft "}]
[null,null,null,null,6229023400,350,"Ventilátor tárcsa",{"$f":"VLOOKUP(E64,Árlista!$B:$D,3,0)","v":"11 820,-Ft "},null,null,null,null,null,2236112434,345,"Henger KIT",{"$f":"VLOOKUP(N64,Árlista!$B:$D,3,0)","v":"15 390,-Ft "}]
[null,null,null,null,6229021000,"360","Olajszint jelző",{"$f":"VLOOKUP(E65,Árlista!$B:$D,3,0)","v":"6 230,-Ft "},null,null,null,null,null,2901325048,350,"Ventilátor tárcsa",{"$f":"VLOOKUP(N65,Árlista!$B:$D,3,0)","v":"12 970,-Ft "}]
[null,null,null,null,6211471500,null,"Légszűrő B49",{"$f":"VLOOKUP(E66,Árlista!$B:$D,3,0)","v":"1 930,-Ft "},null,null,null,null,null,2236111619,355,"Dugattyú-hajtókar KIT",{"$f":"VLOOKUP(N66,Árlista!$B:$D,3,0)","v":"9 940,-Ft "}]
[null,null,null,null,null,null,null,null,null,null,null,null,null,2901325049,360,"Olajszint jelző",{"$f":"VLOOKUP(N67,Árlista!$B:$D,3,0)","v":"14 600,-Ft "}]
[null,null,null,null,null,null,null,null,null,null,null,null,null,2236112437,365,"Forgattyús ház töm.",{"$f":"VLOOKUP(N68,Árlista!$B:$D,3,0)","v":"4 610,-Ft "}]
[]
[null,null,null,null,null,null,null,null,null,null,null,null,null,1630020700,"KM1","Karbantartó KIT KM1",{"$f":"VLOOKUP(N70,Árlista!$B:$D,3,0)","v":"3 850,-Ft "}]
[null,null,null,null,null,null,null,null,null,null,null,null,null,8973037865,"KM2","NO",{"$f":"VLOOKUP(N71,Árlista!$B:$D,3,0)","v":",-Ft "}]
[null,null,null,null,null,null,null,null,null,null,null,null,null,8973037657,"PK1","Karbantartó KIT PK1",{"$f":"VLOOKUP(N72,Árlista!$B:$D,3,0)","v":"13 790,-Ft "}]
[null,null,null,null,null,null,null,null,null,null,null,null,null,8973037658,"PK2","NO"]
[]
[]
[]
[]
[]
[]
[]
[]
[]
[]
[]
[]
[]
[]
[]
[]
[]
[]
[]
[]
[]
[]
[]
[]
[]
[]
[]
[]
[]
[null,null,null,null,"B3800",null,null,null,null,null,"Rodcraft",null,null,"A39"]
[null,null,null,"Motorteljesítmény méret  [kW]","2,2 / 3,0","2 hengeres 1 fokozatú sűrítőfokozat, 220V és 400V-os villanymotorokhoz\n",null,null,null,null,"Típus",null,null,"3,0","2 hengeres 2 fokozatú sűrítőfokozat, 3kW-os 400V-os villanymotorokhoz\n"]
[null,null,null,"Sűrítő fordulat [rpm]","1100 - 1400",null,null,null,null,null,null,null,null,"1100 / 1400"]
[null,null,null,"Cikkszám / Típus / Nettó ár (Listaár)",6218739400,"B3800","Sűrítő",{"$f":"VLOOKUP(E106,Árlista!$B:$D,3,0)","v":"80 000,-Ft "},null,null,"Cikkszám / Típus / Nettó ár (Listaár)",null,null,4116090310,"A39B","Sűrítő",{"$f":"VLOOKUP(N106,Árlista!$B:$D,3,0)","v":"72 900,-Ft "}]
[null,null,null,null,6229024000,315,"Hengerfej + töm",{"$f":"VLOOKUP(E107,Árlista!$B:$D,3,0)","v":"15 560,-Ft "},null,null,null,null,null,2236111635,305,"Levegőszűrő",{"$f":"VLOOKUP(N107,Árlista!$B:$D,3,0)","v":"2 270,-Ft "}]
[null,null,null,null,6229020400,"340","Utóhűtő",{"$f":"VLOOKUP(E108,Árlista!$B:$D,3,0)","v":"15 070,-Ft "},null,null,null,null,null,2901325044,310,"Hengerfej + töm",{"$f":"VLOOKUP(N108,Árlista!$B:$D,3,0)","v":"23 730,-Ft "}]
[null,null,null,null,8973037621,335,"Szeleplap KIT",{"$f":"VLOOKUP(E109,Árlista!$B:$D,3,0)","v":",-Ft "},null,null,null,null,null,2236112518,325,"Szeleplap + töm",{"$f":"VLOOKUP(N109,Árlista!$B:$D,3,0)","v":"8 550,-Ft "}]
[null,null,null,null,2901324900,330,"Felújító KIT",{"$f":"VLOOKUP(E110,Árlista!$B:$D,3,0)","v":"29 280,-Ft "},null,null,null,null,null,2901325046,330,"Felújító KIT",{"$f":"VLOOKUP(N110,Árlista!$B:$D,3,0)","v":"20 580,-Ft "}]
[null,null,null,null,6229023600,350,"Tömítés készlet",{"$f":"VLOOKUP(E111,Árlista!$B:$D,3,0)","v":"5 710,-Ft "},null,null,null,null,null,2901325045,335,"Tömítés készlet",{"$f":"VLOOKUP(N111,Árlista!$B:$D,3,0)","v":"10 070,-Ft "}]
[null,null,null,null,6229020900,360,"Ventilátor tárcsa",{"$f":"VLOOKUP(E112,Árlista!$B:$D,3,0)","v":"22 670,-Ft "},null,null,null,null,null,2236112438,365,"Forgattyús ház töm.",{"$f":"VLOOKUP(N112,Árlista!$B:$D,3,0)","v":"5 600,-Ft "}]
[null,null,null,null,6229021000,"PK1","Ventilátor tárcsa",{"$f":"VLOOKUP(E113,Árlista!$B:$D,3,0)","v":"6 230,-Ft "},null,null,null,null,null,2901325047,340,"Utóhűtő",{"$f":"VLOOKUP(N113,Árlista!$B:$D,3,0)","v":"19 990,-Ft "}]
[null,null,null,null,8973037620,"PK2","Olajszint jelző",null,null,null,null,null,null,2236112435,345,"Henger + töm",{"$f":"VLOOKUP(N114,Árlista!$B:$D,3,0)","v":"16 880,-Ft "}]
[null,null,null,null,6211471500,null,"Légszűrő B49",{"$f":"VLOOKUP(E115,Árlista!$B:$D,3,0)","v":"1 930,-Ft "},null,null,null,null,null,2901325050,350,"Ventilátor tárcsa",{"$f":"VLOOKUP(N115,Árlista!$B:$D,3,0)","v":"22 610,-Ft "}]
[null,null,null,null,null,null,null,null,null,null,null,null,null,2236111620,355,"Dugattyú-hajtókar KIT",{"$f":"VLOOKUP(N116,Árlista!$B:$D,3,0)","v":"10 370,-Ft "}]
[null,null,null,null,null,null,null,null,null,null,null,null,null,2901325049,360,"Olajszint jelző",{"$f":"VLOOKUP(N117,Árlista!$B:$D,3,0)","v":"14 600,-Ft "}]
[null,null,null,null,null,null,null,null,null,null,null,null,null,8973037864,"KM1","Karbantartó KIT KM1","3 130,-Ft "]
[null,null,null,null,null,null,null,null,null,null,null,null,null,8973037865,"KM2","NO",",-Ft "]
[null,null,null,null,null,null,null,null,null,null,null,null,null,8973037657,"PK1","Karbantartó KIT PK1","9 960,-Ft "]
[null,null,null,null,null,null,null,null,null,null,null,null,null,8973037658,"PK2","NO","13 380,-Ft "]
[]
[]
[]
[]
[]
[]
[]
[]
[]
[]
[]
[]
[]
[]
[]
[]
[]
[]
[]
[]
[]
[]
[]
[]
[]
[]
[]
[]
[]
[null,null,null,null,"B4900",null,null,null,null,null,null,null,null,"B5900B"]
[null,null,null,"Motorteljesítmény méret  [kW]","3,0","2 hengeres 2 fokozatú sűrítőfokozat, 3kW-os 400V-os villanymotorokhoz\n",null,null,null,null,"Típus",null,null,"3,0 / 4,0","2 hengeres 2 fokozatú sűrítőfokozat, 3 és 4 kw-os 400V-os villanymotorokhoz\n"]
[null,null,null,"Sűrítő fordulat [rpm]","1100 / 1400",null,null,null,null,null,null,null,null,"1100 / 1400"]
[null,null,null,"Cikkszám / Típus / Nettó ár (Listaár)",6218739600,"B4900","Sűrítő",{"$f":"VLOOKUP(E154,Árlista!$B:$D,3,0)","v":"93 000,-Ft "},null,null,"Cikkszám / Típus / Nettó ár (Listaár)",null,null,6218740200,"B5900","Sűrítő",{"$f":"VLOOKUP(N154,Árlista!$B:$D,3,0)","v":"119 000,-Ft "}]
[null,null,null,null,2901324960,310,"Hengerfej",{"$f":"VLOOKUP(E155,Árlista!$B:$D,3,0)","v":"23 480,-Ft "},null,null,null,null,null,2901324964,310,"Hengerfej",{"$f":"VLOOKUP(N155,Árlista!$B:$D,3,0)","v":"23 500,-Ft "}]
[null,null,null,null,2901324961,320,"Töltő-hűtő cső",{"$f":"VLOOKUP(E156,Árlista!$B:$D,3,0)","v":"30 210,-Ft "},null,null,null,null,null,2901324965,320,"Töltő-hűtő cső",{"$f":"VLOOKUP(N156,Árlista!$B:$D,3,0)","v":"28 710,-Ft "}]
[null,null,null,null,6229017300,330,"Felújító KIT +szelepl.",{"$f":"VLOOKUP(E157,Árlista!$B:$D,3,0)","v":"39 300,-Ft "},null,null,null,null,null,6229026900,330,"Felújító KIT +szelepl.",{"$f":"VLOOKUP(N157,Árlista!$B:$D,3,0)","v":"38 520,-Ft "}]
[null,null,null,null,8973035118,335,"Tömítés KIT +szelepl.",{"$f":"VLOOKUP(E158,Árlista!$B:$D,3,0)","v":"16 460,-Ft "},null,null,null,null,null,8973037264,335,"Tömítés KIT",{"$f":"VLOOKUP(N158,Árlista!$B:$D,3,0)","v":"8 460,-Ft "}]
[null,null,null,null,2901324962,340,"Utóhűtő",{"$f":"VLOOKUP(E159,Árlista!$B:$D,3,0)","v":"21 200,-Ft "},null,null,null,null,null,2901324966,340,"Utóhűtő",{"$f":"VLOOKUP(N159,Árlista!$B:$D,3,0)","v":"27 770,-Ft "}]
[null,null,null,null,6229017600,350,"Ventilátor tárcsa",{"$f":"VLOOKUP(E160,Árlista!$B:$D,3,0)","v":"19 730,-Ft "},null,null,null,null,null,6229020100,350,"Ventilátor tárcsa",{"$f":"VLOOKUP(N160,Árlista!$B:$D,3,0)","v":",-Ft "}]
[null,null,null,null,2901324950,360,"Olajszint jelző",{"$f":"VLOOKUP(E161,Árlista!$B:$D,3,0)","v":"6 790,-Ft "},null,null,null,null,null,2901324951,360,"Olajszint jelző",{"$f":"VLOOKUP(N161,Árlista!$B:$D,3,0)","v":",-Ft "}]
[null,null,null,null,2901324963,370,"Biztonsági szelep KIT",{"$f":"VLOOKUP(E162,Árlista!$B:$D,3,0)","v":",-Ft "},null,null,null,null,null,6229020200,370,"Biztonsági szelep KIT",{"$f":"VLOOKUP(N162,Árlista!$B:$D,3,0)","v":"2 230,-Ft "}]
[null,null,null,null,8973035059,380,"Szűrőbetét",{"$f":"VLOOKUP(E163,Árlista!$B:$D,3,0)","v":"1 570,-Ft "},null,null,null,null,null,8973037628,"PK1","Karbantartó KIT PK1",{"$f":"VLOOKUP(N163,Árlista!$B:$D,3,0)","v":"52 310,-Ft "}]
[null,null,null,null,8973037624,"PK1","Karbantartó KIT PK1",{"$f":"VLOOKUP(E164,Árlista!$B:$D,3,0)","v":"26 870,-Ft "},null,null,null,null,null,6211452400,null,"Levegőszűrő",{"$f":"VLOOKUP(N164,Árlista!$B:$D,3,0)","v":"8 350,-Ft "}]
[null,null,null,null,6211471500,null,"Légszűrő B49",{"$f":"VLOOKUP(E165,Árlista!$B:$D,3,0)","v":"1 930,-Ft "},null,null,null,null,null,8973037630,"PK3","Karbantartó KIT PK3",{"$f":"VLOOKUP(N165,Árlista!$B:$D,3,0)","v":"42 890,-Ft "}]
[null,null,null,null,null,null,null,null,null,null,null,null,null,2236112802,"PK4","B5900 Dug-Hajtókar ","7 500,-Ft",null,"Kis dugattyú"]
[]
[]
[]
[]
[]
[]
[]
[]
[]
[]
[]
[]
[]
[]
[]
[]
[]
[]
[]
[]
[]
[]
[]
[]
[]
[]
[]
[]
[null,null,null,null,"B6000",null,null,null,null,null,null,null,null,"B7000"]
[null,null,null,"Motorteljesítmény méret  [kW]","4,0 / 5,5","2 hengeres 2 fokozatú sűrítőfokozat, 4 és 5,5 kw-os 400V-os villanymotorokhoz\n",null,null,null,null,"Típus",null,null,"5,5 / 7,5","2 hengeres 2 fokozatú sűrítőfokozat, 5,5 és 7,5 kw-os 400V-os villanymotorokhoz\n"]
[null,null,null,"Sűrítő fordulat [rpm]","1100 - 1400",null,null,null,null,null,null,null,null,"1100 / 1400"]
[null,null,null,"Cikkszám / Típus / Nettó ár (Listaár)",6218740100,"B6000","Sűrítő",{"$f":"VLOOKUP(E198,Árlista!$B:$D,3,0)","v":"149 000,-Ft "},null,null,"Cikkszám / Típus / Nettó ár (Listaár)",null,null,6218740000,"B7000","Sűrítő",{"$f":"VLOOKUP(N198,Árlista!$B:$D,3,0)","v":"179 000,-Ft "}]
[null,null,null,null,2901324967,310,"Hengerfej",{"$f":"VLOOKUP(E199,Árlista!$B:$D,3,0)","v":"34 090,-Ft "},null,null,null,null,null,2901324969,310,"Hengerfej",{"$f":"VLOOKUP(N199,Árlista!$B:$D,3,0)","v":"39 130,-Ft "}]
[null,null,null,null,2901324968,320,"Töltő-hűtő cső",{"$f":"VLOOKUP(E200,Árlista!$B:$D,3,0)","v":"33 090,-Ft "},null,null,null,null,null,2901324970,320,"Töltő-hűtő cső",{"$f":"VLOOKUP(N200,Árlista!$B:$D,3,0)","v":"42 570,-Ft "}]
[null,null,null,null,6229027600,330,"Felújító KIT",{"$f":"VLOOKUP(E201,Árlista!$B:$D,3,0)","v":"35 640,-Ft "},null,null,null,null,null,6229028200,330,"Felújító KIT",{"$f":"VLOOKUP(N201,Árlista!$B:$D,3,0)","v":"43 720,-Ft "}]
[null,null,null,null,8973035123,335,"Tömítés készlet",{"$f":"VLOOKUP(E202,Árlista!$B:$D,3,0)","v":"7 110,-Ft "},null,null,null,null,null,8973035130,335,"Tömítés készlet",{"$f":"VLOOKUP(N202,Árlista!$B:$D,3,0)","v":"13 110,-Ft "}]
[null,null,null,null,2901324966,340,"Utóhűtő",{"$f":"VLOOKUP(E203,Árlista!$B:$D,3,0)","v":"27 770,-Ft "},null,null,null,null,null,2901324966,340,"Utóhűtő",{"$f":"VLOOKUP(N203,Árlista!$B:$D,3,0)","v":"27 770,-Ft "}]
[null,null,null,null,6229020100,350,"Ventilátor tárcsa",{"$f":"VLOOKUP(E204,Árlista!$B:$D,3,0)","v":",-Ft "},null,null,null,null,null,6229020100,350,"Ventilátor tárcsa",{"$f":"VLOOKUP(N204,Árlista!$B:$D,3,0)","v":",-Ft "}]
[null,null,null,null,2901324952,360,"Olaj beöntő, és kéml.",{"$f":"VLOOKUP(E205,Árlista!$B:$D,3,0)","v":"12 020,-Ft "},null,null,null,null,null,2901324953,360,"Olaj beöntő, és kéml.",{"$f":"VLOOKUP(N205,Árlista!$B:$D,3,0)","v":"12 040,-Ft "}]
[null,null,null,null,6229020200,370,"Biztonsági szelep KIT",{"$f":"VLOOKUP(E206,Árlista!$B:$D,3,0)","v":"2 230,-Ft "},null,null,null,null,null,6229020200,370,"Biztonsági szelep KIT",{"$f":"VLOOKUP(N206,Árlista!$B:$D,3,0)","v":"2 230,-Ft "}]
[null,null,null,null,8973037632,"PK1","Karbantartó KIT PK1",{"$f":"VLOOKUP(E207,Árlista!$B:$D,3,0)","v":"75 170,-Ft "},null,null,null,null,null,8973037636,"PK1","Szeleplap KIT",{"$f":"VLOOKUP(N207,Árlista!$B:$D,3,0)","v":"91 140,-Ft "}]
[null,null,null,null,8973037634,"PK3","Karbantartó KIT PK3",{"$f":"VLOOKUP(E208,Árlista!$B:$D,3,0)","v":"68 020,-Ft "}]
[null,null,null,null,2236110427,null,"Lev. szűrő panel müa",{"$f":"VLOOKUP(E209,Árlista!$B:$D,3,0)","v":"15 060,-Ft "},null,null,null,null,null,2236110428,null,"Lev. szűrő panel müa",{"$f":"VLOOKUP(N209,Árlista!$B:$D,3,0)","v":"17 480,-Ft "}]
[null,null,null,null,8973015500,null,"Levegő szűrő betét",{"$f":"VLOOKUP(E210,Árlista!$B:$D,3,0)","v":"5 660,-Ft "},null,null,null,null,null,8973015500,null,"Levegő szűrő betét",{"$f":"VLOOKUP(N210,Árlista!$B:$D,3,0)","v":"5 660,-Ft "}]

{"sheet":"Nyomáskapcsolók","index":19,"n_rows":84,"n_cols":17,"rows_kept":84,"cut":false,"hidden":false,"merged":[[77,7,82,9],[77,11,82,13],[77,15,82,17],[76,6,76,9],[76,10,76,13],[76,14,76,17],[58,6,58,9],[58,10,58,13],[58,14,58,17],[59,7,64,9],[59,11,64,13],[59,15,64,17],[33,1,33,4],[34,1,34,4],[28,1,28,4],[29,1,29,4],[30,1,30,4],[31,1,31,4],[32,1,32,4],[15,6,15,9],[15,10,15,13],[15,14,15,17],[16,7,21,9],[16,11,21,13],[16,15,21,17],[38,6,38,9],[38,10,38,13],[38,14,38,17],[39,7,44,9],[39,11,44,13]]}
["TARTALOM"]
["Árlista"]
["Megrendelő"]
["ABAC dugattyús kompresszorok"]
["ABAC CleanAir fogászati kompresszor"]
["AGRE ipari dugattyús kompresszorok"]
["ALUP SONETTO csavarkomp 2,2-15kW"]
["ALUP SCK csavarkomp 4-75kW"]
["ALUP LARGO, ALLEGRO csavarkompr"]
["ALUP Hűtveszárítók"]
["ALUP szűrők"]
["ALUP SpiralAir -Scroll kompresszor"]
["ALUP dugattyús kompresszorok"]
["OMEGA vonali szűrők"]
["OMEGA ciklonszűrők",null,null,null,null,null,"MDR 1",null,"MDR 2",null,null,null,"MDR 3",null,null,null,"MDR 5"]
["OMEGA olaj-víz szétválasztók",null,null,null,null,null,"MDR 2-11 Nyomáskapcsoló",null,null,null,"MDR 3-11 Nyomáskapcsoló",null,null,null,"MDR 5-11 Nyomáskapcsoló"]
["ABAC sűrítők",null,null,null,null,"Pólusok száma","2","Condor nyomáskapcsoló 1 fázisú motorokhoz. Megbizható, hosszú élettartam. Nyomáskülönbség állítással, tehermentesítővel",null,null,"3","Condor nyomáskapcsoló 3 fázisú motorokhoz. Megbizható, hosszú élettartam. Nyomáskülönbség állítással, motorvédelemmel és tehermentesítővel szerelve.",null,null,"3","Condor nyomáskapcsoló 3 fázisú motorokhoz. Megbizható, hosszú élettartam. Nyomáskülönbség állítással, motorvédelemmel és tehermentesítővel szerelve."]
["CONDOR nyomáskapcsolók",null,null,null,null,"Feszültség","230V",null,null,null,"400V",null,null,null,"400V"]
["Tartályok",null,null,null,null,"Max. motorteljesítmény","2,2",null,null,null,"11",null,null,null,"11"]
["Egyéb alaktrészek",null,null,null,null,"Csatlakozások","4 x 1/4\"",null,null,null,"1/2\" + 3x1/4\"",null,null,null,"1/2\" + 1x1/4\""]
[null,null,null,null,null,"Nyomástartomány","3-12",null,null,null,"3-11",null,null,null,"3-11"]
[null,null,null,null,null,"Nomáskülönbség","2",null,null,null,"2",null,null,null,"2"]
[null,null,null,null,null,"Cikkszám / Típus / (Listaár) Nettó ár","CO-212140","MDR 1/11",{"$f":"VLOOKUP(G23,Árlista!$B:$D,3,0)","v":"6 500,-Ft "},null,"CO-218937","4-6,3A",{"$f":"VLOOKUP(K23,Árlista!$B:$D,3,0)","v":"17 990,-Ft "},null,"CO-218630","2,4-4,2A",{"$f":"VLOOKUP(O23,Árlista!$B:$D,3,0)","v":"18 750,-Ft "}]
[null,null,null,null,null,"Cikkszám / Típus / (Listaár) Nettó ár",null,null,null,null,"CO-218944","6,3-10A",{"$f":"VLOOKUP(K24,Árlista!$B:$D,3,0)","v":"17 990,-Ft "},null,"CO-218593","4-7,0A",{"$f":"VLOOKUP(O24,Árlista!$B:$D,3,0)","v":"18 750,-Ft "}]
[null,null,null,null,null,"Cikkszám / Típus / (Listaár) Nettó ár","CO-218500","MDR 2/11",{"$f":"VLOOKUP(G25,Árlista!$B:$D,3,0)","v":"8 880,-Ft "},null,"CO-218951","10-16A",{"$f":"VLOOKUP(K25,Árlista!$B:$D,3,0)","v":"17 990,-Ft "},null,"CO-218586","6,1-10,3A",{"$f":"VLOOKUP(O25,Árlista!$B:$D,3,0)","v":"18 750,-Ft "}]
[null,null,null,null,null,"Cikkszám / Típus / (Listaár) Nettó ár",null,null,null,null,"CO-240686","16-20A",{"$f":"VLOOKUP(K26,Árlista!$B:$D,3,0)","v":"17 990,-Ft "},null,"CO-218623","9-14A",{"$f":"VLOOKUP(O26,Árlista!$B:$D,3,0)","v":"18 750,-Ft "}]
[null,null,null,null,null,"Cikkszám / Típus / (Listaár) Nettó ár",null,null,null,null,"CO-240693","20-24A",{"$f":"VLOOKUP(K25,Árlista!$B:$D,3,0)","v":"17 990,-Ft "},null,"CO-251057","11-18A",{"$f":"VLOOKUP(O27,Árlista!$B:$D,3,0)","v":"18 960,-Ft "}]
[]
["Jellemző motorméretek: ","230V",null,null,null,"  400V"]
["1,5 kW  ","10,0A",null,null,null,"  3,4A"]
["2,2 kW  ","14,5A",null,null,null,"  5,2A"]
["3,0 kW  ","-",null,null,null,"  7,2A"]
["4,0 kW  ","-",null,null,null,"  9,6A"]
["5,5 kW  ","-",null,null,null," 13,0A"]
["7,5 kW  ","-",null,null,null," 16,1A"]
[]
[]
[null,null,null,null,null,null,null,null,null,null,null,"MDR 43","MDR 53"]
[null,null,null,null,null,null,"MDR Tehermentesítő nyomáskapcsolókhoz",null,null,null,"MDR Vezérlő nyomáskapcsolók",null,null,null,"MDR Motorvédő relé"]
[null,null,null,null,null,"Pólusok száma","2","Condor nyomáskapcsoló 1 fázisú motorokhoz. Megbizható, hosszú élettartam. Nyomáskülönbség állítással, tehermentesítővel",null,null,"2","Condor vezérlő nyomáskapcsolók",null,null,"CO-201441","R3/6,3A",{"$f":"VLOOKUP(O40,Árlista!$B:$D,3,0)","v":"8 450,-Ft "}]
[null,null,null,null,null,"Feszültség","230",null,null,null,"230",null,null,null,"CO-201458","R3/10A",{"$f":"VLOOKUP(O41,Árlista!$B:$D,3,0)","v":"8 450,-Ft "}]
[null,null,null,null,null,"Max. motorteljesítmény","2,2",null,null,null,"2,2",null,null,null,"CO-201465","R3/16A",{"$f":"VLOOKUP(O42,Árlista!$B:$D,3,0)","v":"8 450,-Ft "}]
[null,null,null,null,null,"Csatlakozások","4 x 1/4\"",null,null,null,"1/2\"",null,null,null,"CO-202042","R5/4,2A",{"$f":"VLOOKUP(O43,Árlista!$B:$D,3,0)","v":"7 480,-Ft "}]
[null,null,null,null,null,"Nyomástartomány","3-12",null,null,null,"3-12",null,null,null,"CO-202059","R5/7A",{"$f":"VLOOKUP(O44,Árlista!$B:$D,3,0)","v":"7 480,-Ft "}]
[null,null,null,null,null,"Nomáskülönbség","2",null,null,null,"2",null,null,null,"CO-202066","R5/10,3A",{"$f":"VLOOKUP(O45,Árlista!$B:$D,3,0)","v":"8 130,-Ft "}]
[null,null,null,null,null,"Cikkszám / Típus / (Listaár) Nettó ár","CO-200680","EV 2S",{"$f":"VLOOKUP(G46,Árlista!$B:$D,3,0)","v":"2 270,-Ft "},null,"CO-213086","MDR 53/16",{"$f":"VLOOKUP(K46,Árlista!$B:$D,3,0)","v":"20 270,-Ft "},null,"CO-202073","R5/14A",{"$f":"VLOOKUP(O46,Árlista!$B:$D,3,0)","v":"8 130,-Ft "}]
[null,null,null,null,null,"Cikkszám / Típus / (Listaár) Nettó ár","CO-201069","EV 3S",{"$f":"VLOOKUP(G47,Árlista!$B:$D,3,0)","v":"2 270,-Ft "},null,"CO-212812","MDR 43/11",{"$f":"VLOOKUP(K47,Árlista!$B:$D,3,0)","v":"15 500,-Ft "},null,"CO-202080","R5/18A",{"$f":"VLOOKUP(O47,Árlista!$B:$D,3,0)","v":"8 560,-Ft "}]
[null,null,null,null,null,"Cikkszám / Típus / (Listaár) Nettó ár","CO-201878","EV 5",{"$f":"VLOOKUP(G48,Árlista!$B:$D,3,0)","v":"3 360,-Ft "}]
[]
[]
[]
[]
[]
[]
[]
[]
[]
[]
[null,null,null,null,null,null,"MDR 3-16 Nyomáskapcsoló",null,null,null,"Nyomásjelado 4-20mA EDS16",null,null,null,"Nyomásjeladó"]
[null,null,null,null,null,"Pólusok száma","3","Condor nyomáskapcsoló 3 fázisú motorokhoz. Megbizható, hosszú élettartam. Nyomáskülönbség állítással, motorvédelemmel és tehermentesítővel szerelve.",null,null,null,"Condor analóg jelátalakító. Bemeneti feszültség: 11-30V DC Kimeneti jel: 4-20mA",null,null,null,"EDI kapcsolótáblába építhető analóg jelátalakító: 4-20mA\n\nEDI kapcsolótáblába építhető vezérlő kapcsoló. Kapcsolási nyomás, és nyomáskülömbség állítással noással  0-10mA"]
[null,null,null,null,null,"Feszültség","400V"]
[null,null,null,null,null,"Max. motorteljesítmény","11"]
[null,null,null,null,null,"Csatlakozások","1/2\" + 3x1/4\"",null,null,null,"1 x 1/4\"",null,null,null,"6 mm"]
[null,null,null,null,null,"Nyomástartomány","3-11",null,null,null,"0-16 bar",null,null,null,"0-16 bar"]
[null,null,null,null,null,"Nomáskülönbség","2"]
[null,null,null,null,null,"Cikkszám / Típus / (Listaár) Nettó ár","CO-253235","3/16 16A",{"$f":"VLOOKUP(G66,Árlista!$B:$D,3,0)","v":"18 310,-Ft "},null,"CO-260257","EDS16",{"$f":"VLOOKUP(K66,Árlista!$B:$D,3,0)","v":"29 340,-Ft "},null,"CO-260226","EDI 16",{"$f":"VLOOKUP(O66,Árlista!$B:$D,3,0)","v":"30 410,-Ft "}]
[null,null,null,null,null,"Cikkszám / Típus / (Listaár) Nettó ár","CO-279679","3/25 16A",{"$f":"VLOOKUP(G66,Árlista!$B:$D,3,0)","v":"18 310,-Ft "},null,null,null,null,null,"CO-260288","EDR 16",{"$f":"VLOOKUP(O67,Árlista!$B:$D,3,0)","v":"29 340,-Ft "}]
[]
[]
[]
[]
[]
[]
[]
[]
[]
[null,null,null,null,null,null,"ABAC Nyomáskapcsoló",null,null,null,"NE-MA 230V",null,null,null,"NE-MA 400V"]
[null,null,null,null,null,"Pólusok száma","2","Made in China… Olcsó, de…",null,null,"3","Már használható... 230V",null,null,"3","400V Motorvédelem nélküli nyomáskapcsoló."]
[null,null,null,null,null,"Feszültség","230V",null,null,null,"400V",null,null,null,"400V"]
[null,null,null,null,null,"Max. motorteljesítmény","2,2",null,null,null,"11",null,null,null,"11"]
[null,null,null,null,null,"Csatlakozások","1 x 1/4\"",null,null,null,"4 x 1/4\"",null,null,null,"4 x 1/4\""]
[null,null,null,null,null,"Nyomástartomány","3-12",null,null,null,"3-11",null,null,null,"3-11"]
[null,null,null,null,null,"Nomáskülönbség","2",null,null,null,"2",null,null,null,"2"]
[null,null,null,null,null,"Cikkszám / Típus / (Listaár) Nettó ár",8973005570,"230V",{"$f":"VLOOKUP(G84,Árlista!$B:$D,3,0)","v":"2 360,-Ft "},null,"KO-PT010002","4-6,3A",{"$f":"VLOOKUP(K84,Árlista!$B:$D,3,0)","v":"4 950,-Ft "},null,"KO-PT020002","2,4-4,2A",{"$f":"VLOOKUP(O84,Árlista!$B:$D,3,0)","v":"7 430,-Ft "}]

{"sheet":"Visszacsapók","index":20,"n_rows":78,"n_cols":17,"rows_kept":78,"cut":false,"hidden":false,"merged":[[71,6,71,9],[71,10,71,13],[71,14,71,17],[55,6,55,9],[55,10,55,13],[55,14,55,17],[15,6,15,9],[15,10,15,13],[15,14,15,17],[35,6,35,9],[35,10,35,13],[35,14,35,17]]}
["TARTALOM"]
["Árlista"]
["Megrendelő"]
["ABAC dugattyús kompresszorok"]
["ABAC CleanAir fogászati kompresszor"]
["AGRE ipari dugattyús kompresszorok"]
["ALUP SONETTO csavarkomp 2,2-15kW"]
["ALUP SCK csavarkomp 4-75kW"]
["ALUP LARGO, ALLEGRO csavarkompr"]
["ALUP Hűtveszárítók"]
["ALUP szűrők"]
["ALUP SpiralAir -Scroll kompresszor"]
["ALUP dugattyús kompresszorok"]
["OMEGA vonali szűrők"]
["OMEGA ciklonszűrők"]
["OMEGA olaj-víz szétválasztók",null,null,null,null,"Rodcraft","Visszacsapó szelep",null,null,null,"Visszacsapó szelep",null,null,null,"Visszacsapó szelep -gyári"]
["ABAC sűrítők",null,null,null,null,"Cikkszám / Típus / (Listaár) Nettó ár","KO-RV141212","KK 1/2\"",{"$f":"VLOOKUP(G17,Árlista!$B:$D,3,0)","v":"2 190,-Ft "},null,"KO-RV161212","BK 1/2-1/2",{"$f":"VLOOKUP(K17,Árlista!$B:$D,3,0)","v":"2 310,-Ft "},null,6210718900,"1/2\"-3/8\"",{"$f":"VLOOKUP(O17,Árlista!$B:$D,3,0)","v":"3 040,-Ft "}]
["CONDOR nyomáskapcsolók",null,null,null,null,"Cikkszám / Típus / (Listaár) Nettó ár","KO-RV141238","KK 3/8\"-1/2\"",{"$f":"VLOOKUP(G18,Árlista!$B:$D,3,0)","v":"1 570,-Ft "},null,"KO-RV161238","BK 1/2-3/8",{"$f":"VLOOKUP(K18,Árlista!$B:$D,3,0)","v":"1 810,-Ft "},null,6210719200,"3/4\"-3/4\""]
["Tartályok",null,null,null,null,"Cikkszám / Típus / (Listaár) Nettó ár","KO-RV143412","KK 1/2\"-3/4\"",{"$f":"VLOOKUP(G19,Árlista!$B:$D,3,0)","v":"2 410,-Ft "},null,"KO-RV163412","BK 3/4-1/2",{"$f":"VLOOKUP(K19,Árlista!$B:$D,3,0)","v":"3 220,-Ft "},null,6210718500,"1\"-3/4\"",{"$f":"VLOOKUP(O19,Árlista!$B:$D,3,0)","v":"8 950,-Ft "}]
["Egyéb alaktrészek",null,null,null,null,"Cikkszám / Típus / (Listaár) Nettó ár","KO-RV143838","KK 3/8\"",{"$f":"VLOOKUP(G20,Árlista!$B:$D,3,0)","v":"1 470,-Ft "},null,"KO-RV163434","BK 3/4-3/4",{"$f":"VLOOKUP(K20,Árlista!$B:$D,3,0)","v":"3 220,-Ft "},null,6210718300,"1\"-1\" ",{"$f":"VLOOKUP(O20,Árlista!$B:$D,3,0)","v":"14 700,-Ft "}]
[null,null,null,null,null,null,null,null,null,null,"KO-RV200101","BB 1-1",{"$f":"VLOOKUP(K21,Árlista!$B:$D,3,0)","v":"5 110,-Ft "},null,2236110859,"1/2\"-1/2\"",{"$f":"VLOOKUP(O21,Árlista!$B:$D,3,0)","v":"11 260,-Ft "}]
[]
[]
[]
[]
[]
[null,null,null,null,null,null,null,null,null,null,null,null,null,null,"ALGUMITONK1","Ø17 11mm",{"$f":"VLOOKUP(O27,Árlista!$B:$D,3,0)","v":"1 060,-Ft "}]
[null,null,null,null,null,null,null,null,null,null,null,null,null,null,"ALGUMITONK3","Ø24 12,8mm",{"$f":"VLOOKUP(O28,Árlista!$B:$D,3,0)","v":"2 270,-Ft "}]
[null,null,null,null,null,null,null,null,null,null,null,null,null,null,"ALGUMITONK3","Ø30 16,2mm",{"$f":"VLOOKUP(O29,Árlista!$B:$D,3,0)","v":"2 270,-Ft "}]
[]
[]
[]
[]
[]
[]
[null,null,null,null,null,"Rodcraft","Szűrő szabályozó 1/2\"",null,null,null,"Szűrő szabályozó 3/8\"",null,null,null,"szabályozó 1/4\""]
[null,null,null,null,null,"Cikkszám / Típus / (Listaár) Nettó ár",6214345100,"PU4 1/2",{"$f":"VLOOKUP(G37,Árlista!$B:$D,3,0)","v":"15 360,-Ft "},null,6214344200,"Mignon 3/8",{"$f":"VLOOKUP(K37,Árlista!$B:$D,3,0)","v":"9 940,-Ft "},null,6214344100,"Micro 1/4",{"$f":"VLOOKUP(O37,Árlista!$B:$D,3,0)","v":"9 380,-Ft "}]
[null,null,null,null,null,"Cikkszám / Típus / (Listaár) Nettó ár",null,null,null,null,"KO-FR860038","3/8 KO-FR",{"$f":"VLOOKUP(K38,Árlista!$B:$D,3,0)","v":"6 190,-Ft "},null,"KO-FR830014","1/4 KO-FR",{"$f":"VLOOKUP(O38,Árlista!$B:$D,3,0)","v":"3 220,-Ft "}]
[null,null,null,null,null,"Cikkszám / Típus / (Listaár) Nettó ár",null,null,null,null,8973005916,"3/8 ABAC",{"$f":"VLOOKUP(K39,Árlista!$B:$D,3,0)","v":"6 750,-Ft "},null,8973005861,"1/4 ABAC",{"$f":"VLOOKUP(O39,Árlista!$B:$D,3,0)","v":"3 760,-Ft "}]
[]
[]
[null,null,null,null,null,null,null,null,null,null,null,null,"3/8 és 1/2\""]
[]
[]
[]
[null,null,null,null,null,null,null,null,null,null,null,null,"B28/38/B49"]
[]
[]
[]
[]
[null,null,null,null,null,null,null,null,null,null,null,null,"A29/A39"]
[]
[]
[]
[]
[null,null,null,null,null,"Rodcraft","Biztonsági szelep",null,null,null,"Levegőszűrő",null,null,null,"Levegőszűrő"]
[null,null,null,null,null,"Cikkszám / Típus / (Listaár) Nettó ár",6210719500,"1/4\", 8 bar",{"$f":"VLOOKUP(G57,Árlista!$B:$D,3,0)","v":"2 530,-Ft "},null,"AB-8973005860","3/8\"",{"$f":"VLOOKUP(K57,Árlista!$B:$D,3,0)","v":"940,-Ft "},null,6211452400,"Betét- B5900",{"$f":"VLOOKUP(O57,Árlista!$B:$D,3,0)","v":"8 350,-Ft "}]
[null,null,null,null,null,"Cikkszám / Típus / (Listaár) Nettó ár",6210719900,"3/8\", 11 bar",{"$f":"VLOOKUP(G58,Árlista!$B:$D,3,0)","v":"4 000,-Ft "},null,"AL8973035810","1/2\"",{"$f":"VLOOKUP(K58,Árlista!$B:$D,3,0)","v":"940,-Ft "},null,2236110427,"B6000",{"$f":"VLOOKUP(O58,Árlista!$B:$D,3,0)","v":"15 060,-Ft "}]
[null,null,null,null,null,"Cikkszám / Típus / (Listaár) Nettó ár",2236100087,"3/4\", 11 bar",{"$f":"VLOOKUP(G59,Árlista!$B:$D,3,0)","v":"10 310,-Ft "},null,2236111635,"A29/A39",{"$f":"VLOOKUP(K59,Árlista!$B:$D,3,0)","v":"2 270,-Ft "},null,2236110428,"B7000",{"$f":"VLOOKUP(O59,Árlista!$B:$D,3,0)","v":"17 480,-Ft "}]
[null,null,null,null,null,"Cikkszám / Típus / (Listaár) Nettó ár","KO-RV110012","1/2\", állíth.",{"$f":"VLOOKUP(G60,Árlista!$B:$D,3,0)","v":"4 130,-Ft "},null,6211471500,"B28/38/B49",{"$f":"VLOOKUP(K60,Árlista!$B:$D,3,0)","v":"1 930,-Ft "},null,8973015500,"Betét B6-7000",{"$f":"VLOOKUP(O60,Árlista!$B:$D,3,0)","v":"5 660,-Ft "}]
[null,null,null,null,null,"Cikkszám / Típus / (Listaár) Nettó ár","KO-RV110014","1/4\", állíth",{"$f":"VLOOKUP(G61,Árlista!$B:$D,3,0)","v":"2 060,-Ft "}]
[null,null,null,null,null,"Cikkszám / Típus / (Listaár) Nettó ár","KO-RV110038","3/8\", állíth",{"$f":"VLOOKUP(G62,Árlista!$B:$D,3,0)","v":"2 470,-Ft "}]
[]
[]
[]
[]
[]
[]
[]
[]
[]
[null,null,null,null,null,"Rodcraft","Manométer hátsó csatlakozással",null,null,null,"Manométer alsó csatlakozással"]
[null,null,null,null,null,"Cikkszám / Típus / (Listaár) Nettó ár","KO-MN604018012P","D40 1/8\" 0-12",{"$f":"VLOOKUP(G73,Árlista!$B:$D,3,0)","v":"1 181,-Ft "},null,"KO-MN654018012R","D40 1/8\" 0-12",{"$f":"VLOOKUP(K73,Árlista!$B:$D,3,0)","v":"1 260,-Ft "}]
[null,null,null,null,null,"Cikkszám / Típus / (Listaár) Nettó ár","KO-MN604018016P","D40 1/8\" 0-16",{"$f":"VLOOKUP(G74,Árlista!$B:$D,3,0)","v":"1 181,-Ft "},null,"KO-MN654018016R","D40 1/8\" 0-16",{"$f":"VLOOKUP(K74,Árlista!$B:$D,3,0)","v":"1 260,-Ft "}]
[null,null,null,null,null,"Cikkszám / Típus / (Listaár) Nettó ár","KO-MN605014012P","D50 1/4\" 0-12",{"$f":"VLOOKUP(G75,Árlista!$B:$D,3,0)","v":"1 409,-Ft "},null,"KO-MN655014012R","D50 1/4\" 0-12",{"$f":"VLOOKUP(K75,Árlista!$B:$D,3,0)","v":"1 409,-Ft "}]
[null,null,null,null,null,"Cikkszám / Típus / (Listaár) Nettó ár","KO-MN605014016P","D50 1/4\" 0-16",{"$f":"VLOOKUP(G76,Árlista!$B:$D,3,0)","v":"1 409,-Ft "},null,"KO-MN655014016R","D50 1/4\" 0-16",{"$f":"VLOOKUP(K76,Árlista!$B:$D,3,0)","v":"1 409,-Ft "}]
[null,null,null,null,null,"Cikkszám / Típus / (Listaár) Nettó ár","KO-MN606314012P","D63 1/4\" 0-12",{"$f":"VLOOKUP(G77,Árlista!$B:$D,3,0)","v":"1 567,-Ft "},null,"KO-MN656314012R","D63 1/4\" 0-12",{"$f":"VLOOKUP(K77,Árlista!$B:$D,3,0)","v":"1 567,-Ft "}]
[null,null,null,null,null,"Cikkszám / Típus / (Listaár) Nettó ár","KO-MN606314016P","D63 1/4\" 0-16",{"$f":"VLOOKUP(G78,Árlista!$B:$D,3,0)","v":"1 567,-Ft "},null,"KO-MN656314016R","D63 1/4\" 0-16",{"$f":"VLOOKUP(K78,Árlista!$B:$D,3,0)","v":"1 567,-Ft "}]